program: Gaussian 09
title: 000007855
version: EM64L-G09RevD.01
frameworkgroup: CS[SG(C3H3N)]
method: RPBEPBE
basis: SDD
operation: Freq
keyword: #p
keyword: freq=noraman
keyword: PBEPBE/SDD
title: #p freq=noraman PBEPBE/SDD
converged: NO NO YES YES
title: Mulliken charges:
elementType: N C C C H H H
charge: -0.016611 -0.096977 -0.467809 -0.146889 0.248384 0.233985 0.245916
chargesum: 0.00000
title: Mulliken charges with hydrogens summed into heavy atoms:
elementType: N C C C
charge: -0.016611 0.151407 0.012093 -0.146889
polarizability: 4.43533347e+01 1.56652924e+01 4.46332845e+01 -6.39350442e-10 -7.82862792e-10 1.56977003e+01
1716.lowfreq: -9.4262 0.0004 0.0004 0.0008 11.7780 16.3419 230.7477 342.4751 563.7365
frequency: 230.7428 342.4719 563.7360 700.1849 868.0353 978.6228 987.3299 1091.0264 1284.5305 1420.1886 1621.8518 2173.3119 3113.8160 3134.2409 3229.7556
redmass: 4.1460 2.6554 4.1060 2.1541 2.7846 1.1048 1.3398 1.6636 1.2669 1.2151 4.1538 12.5251 1.0594 1.0932 1.1168
irintensity: 0.8939 0.4643 0.5199 9.3165 0.4727 93.4948 7.6897 8.1385 0.0618 11.3675 2.5886 6.5198 1.0444 2.6146 7.8029
temp: 298.150 k
press: 1.00000 atm
elementType: 7 6 6 6 1 1 1
symmnumber: 1
zpe: 130033.2 jmol-1
zpe.correction: 0.049527 hartree
zpe.thermalcorrener: 0.053724 hartree
zpe.thermalcorrenthalpy: 0.054669 hartree
zpe.thermalcorrgfe: 0.023568 hartree
zpe.sumelectzpe: -170.536826 hartree
zpe.sumelectthermal: -170.532629 hartree
zpe.sumelectthermalent: -170.531685 hartree
zpe.sumelectthermalfe: -170.562786 hartree
dipole: 1.9709 3.4249 0.0000
dipole: 3.9515
quadrupole: -22.1807 -25.5134 -24.9939
quadrupole: -2.8752 0.0000 0.0000
quadrupole: 2.0486 -1.2841 -0.7646 -2.8752 0.0000 0.0000
hfenergy: -170.5863535 hartree
pointgroup: CS [SG(C3H3N1)]
dipole: 1.533954 0.2528409 0. debye
dipolederiv: -0.2911118 0.0431794 0. -0.0131317 -0.2108511 0. 0. 0. -0.2478922 0.0249715 0.0228563 0. 0.1252078 0.2169174 0. 0. 0. -0.0693216 0.0089774 0.0467146 0. 0.0124041 0.0747319 0. 0. 0. -0.3107746 0.1715181 -0.0059972 0. 0.0035315 -0.0866958 0. 0. 0. 0.0547952 0.048213 -0.0100763 0. -0.0428134 -0.0245679 0. 0. 0. 0.1935137 -0.0492679 -0.0550433 0. -0.0531306 0.073712 0. 0. 0. 0.1762923 0.0866997 -0.0416336 0. -0.0320677 -0.0432465 0. 0. 0. 0.2033872 unknown
polarizability: 59.8749913|-2.9706644|29.1116279|0.|0.|15.6977003 unknown
InChI: InChI=1S/C3H3N/c1-2-3-4/h2H,1H2
charge 0 multiplicity 1
7 atoms
N  -1.834906 -0.180784 0.0000
C  0.712986 0.49057 0.0000
C  1.739971 -0.403893 0.0000
C  -0.672912 0.108782 0.0000
H  0.909326 1.57005 0.0000
H  2.778973 -0.059251 0.0000
H  1.563662 -1.484174 0.0000
