program: Gaussian 09
title: 000007852
version: EM64L-G09RevD.01
frameworkgroup: C1[X(C3H9N)]
method: RPBEPBE
basis: SDD
operation: Freq
keyword: #p
keyword: freq=noraman
keyword: PBEPBE/SDD
title: #p freq=noraman PBEPBE/SDD
converged: NO YES NO NO
title: Mulliken charges:
elementType: N C C C H H H H H H H H H
charge: -0.549332 -0.346135 -0.371645 -0.672004 0.190192 0.190172 0.202263 0.202308 0.208702 0.208720 0.215700 0.260528 0.260530
chargesum: 0.00000
title: Mulliken charges with hydrogens summed into heavy atoms:
elementType: N C C C
charge: -0.028274 0.034229 0.032926 -0.038882
polarizability: 4.69376823e+01 1.52103790e+00 3.70449474e+01 -1.01954097e-03 1.52571737e-03 3.80369464e+01
1716.lowfreq: -43.0356 -18.0786 -16.3629 -0.0009 -0.0009 -0.0009 122.8865 214.7419 252.2045
frequency: 122.8526 214.5885 252.2022 260.0161 430.3752 613.3094 732.9696 841.2138 873.3300 998.7991 1034.1189 1085.6219 1111.1552 1207.9566 1280.8130 1295.1946 1330.5625 1349.1248 1387.7929 1457.0149 1469.7278 1478.9220 1484.9342 1642.7450 2960.9682 2972.1219 2978.9174 3004.1620 3040.3280 3067.6115 3073.0219 3447.0969 3572.8750
redmass: 2.0119 1.0809 2.3977 1.0824 2.5735 1.5335 1.0790 1.1404 1.7998 1.0939 3.5211 2.8132 2.5565 1.5612 1.1621 1.3226 1.1798 1.3580 1.2086 1.0756 1.0731 1.0419 1.0672 1.0881 1.0586 1.0371 1.0595 1.1004 1.1052 1.1009 1.0994 1.0445 1.0971
irintensity: 0.2527 15.3941 6.2517 48.2360 11.5491 287.3185 7.8726 1.0244 33.8406 0.6700 0.6081 12.3911 5.4163 0.0505 0.0473 0.2763 0.0010 2.4381 13.5264 0.2415 4.5157 12.5756 13.3263 32.1960 24.6012 23.1415 82.8080 2.8009 38.6130 93.9003 49.2558 1.5650 0.0296
temp: 298.150 k
press: 1.00000 atm
elementType: 7 6 6 6 1 1 1 1 1 1 1 1 1
symmnumber: 1
zpe: 311462.4 jmol-1
zpe.correction: 0.118630 hartree
zpe.thermalcorrener: 0.124520 hartree
zpe.thermalcorrenthalpy: 0.125464 hartree
zpe.thermalcorrgfe: 0.090543 hartree
zpe.sumelectzpe: -174.097119 hartree
zpe.sumelectthermal: -174.091228 hartree
zpe.sumelectthermalent: -174.090284 hartree
zpe.sumelectthermalfe: -174.125206 hartree
dipole: -0.7879 1.2317 -0.0008
dipole: 1.4621
quadrupole: -30.5750 -27.2598 -24.9881
quadrupole: 3.9176 -0.0024 0.0006
quadrupole: -2.9674 0.3478 2.6195 3.9176 -0.0024 0.0006
hfenergy: -174.2157485 hartree
pointgroup: C01[X(C3H9N1)]
dipole: -0.3318866 -0.4698377 0.0002018 debye
dipolederiv: -0.9983138 -0.1430242 -0.0002359 -0.2238065 -0.4678645 0.0001269 -0.0002276 0.000114 -0.1779755 -0.1098204 -0.0119983 -0.0000683 -0.082491 0.037494 -0.000004 0.0000097 -0.0000348 0.1799637 0.6043031 -0.0141097 0.0002137 -0.0365153 0.3344034 -0.0001858 0.0002414 -0.0000744 0.2215452 -0.0959277 0.039521 -0.0000066 -0.0027793 0.0495007 -0.0000425 0.0000247 -0.0000102 0.0929407 0.0226242 0.0311636 0.0352167 0.0111498 -0.0460714 -0.1222547 0.0293933 -0.157436 -0.1031523 0.0225803 0.031206 -0.0352168 0.0112157 -0.0462258 0.1222907 -0.0294217 0.15747 -0.1029817 0.0055529 0.0250667 0.0249532 0.0029938 -0.0359078 -0.1154181 0.0320751 -0.1546522 -0.0886919 0.0056069 0.0248357 -0.0248619 0.0028206 -0.0356983 0.1153907 -0.031993 0.154644 -0.0889716 0.0714282 0.0125776 -0.0069025 0.05622 -0.0133712 -0.1267907 0.039968 -0.1382317 -0.0904552 0.071398 0.0126961 0.006786 0.0563193 -0.0134195 0.1267807 -0.0400532 0.1382346 -0.0903563 -0.1407122 -0.1138067 0.0000246 -0.1416076 -0.0196359 0.0000322 0.0000631 0.0000184 0.1008788 0.2707043 0.0529375 -0.0741297 0.1733101 0.1282412 -0.1491854 -0.0189356 -0.1014661 0.0737667 0.2705762 0.0529347 0.0742276 0.1731706 0.1285551 0.1492599 0.0188558 0.1014245 0.0734894 unknown
polarizability: 46.7773395|-1.9682654|37.2052891|0.0028213|0.0009747|38.0369475 unknown
InChI: InChI=1S/C3H9N/c1-2-3-4/h2-4H2,1H3
charge 0 multiplicity 1
13 atoms
N  1.932543 -0.161205 0.000154
C  -0.607531 -0.541136 -0.001078
C  0.587031 0.451142 -0.00084
C  -1.976421 0.174101 -0.00066
H  -0.526735 -1.20057 -0.889881
H  -0.526541 -1.201281 0.887182
H  0.511583 1.112861 0.884604
H  0.512586 1.112033 -0.886986
H  -2.086703 0.818602 0.892192
H  -2.087288 0.818799 -0.893295
H  -2.812516 -0.548775 -0.000478
H  2.139416 -0.702465 -0.845962
H  2.138676 -0.701206 0.847248
