program: Gaussian 09
title: 000089755
version: EM64L-G09RevD.01
frameworkgroup: C1[X(C10H18O)]
method: RPBEPBE
basis: SDD
operation: Freq
keyword: #pfreq=noraman
keyword: PBEPBE/SDD
title: #p freq=noraman PBEPBE/SDD
converged: NO YES NO NO
title: Mulliken charges:
elementType: O C C C C C C C C C C H H H H H H H H H H H H H H H H H H
charge: -0.455413 -0.010929 -0.093468 -0.097356 -0.504337 -0.440846 -0.468492 -0.751748 0.487367 -0.829832 -0.733639 0.213789 0.182552 0.176094 0.211661 0.195348 0.193347 0.203591 0.214164 0.203899 0.255699 0.196027 0.206358 0.330552 0.227474 0.220863 0.227250 0.212606 0.227419
chargesum: 0.00000
title: Mulliken charges with hydrogens summed into heavy atoms:
elementType: O C C C C C C C C C C
charge: -0.124861 0.202860 0.089084 0.078738 -0.097328 -0.043908 -0.050429 -0.093665 0.487367 -0.154245 -0.293613
polarizability: 1.26139087e+02 -5.33151847e+00 1.12133990e+02 2.18073259e+00 -6.60374955e+00 8.67044420e+01
1716.lowfreq: -14.4000 -9.9938 -0.0005 -0.0004 0.0008 14.6397 30.7745 72.4130 129.5445
frequency: 30.4293 72.3773 129.5323 157.3897 168.5525 194.8845 210.5027 262.2858 286.0748 297.5148 325.8919 340.9372 349.5249 435.7447 449.4848 480.8181 525.9690 527.1875 567.0311 697.0165 765.9974 819.3542 841.8750 888.9951 909.2744 921.4965 927.7383 959.2603 976.6230 992.1136 1009.0092 1031.1253 1050.3848 1056.8643 1073.0112 1089.1112 1111.0191 1137.8648 1170.9457 1200.2516 1217.4313 1245.7771 1256.3246 1274.2994 1281.3782 1298.4155 1318.2667 1321.2740 1326.9965 1341.0683 1360.3286 1377.7421 1392.6901 1401.3818 1425.2958 1459.2284 1462.0153 1463.5579 1471.0041 1473.1747 1477.8240 1482.3918 1663.5316 2905.1210 2917.4381 2955.5782 2965.7822 2966.5586 2969.5909 2974.4692 2976.6579 3026.5167 3030.6229 3038.9505 3043.7218 3058.5668 3084.8842 3097.3316 3097.8954 3196.7508 3555.7971
redmass: 2.4340 3.0004 2.1418 1.5851 2.4390 1.0831 1.9793 3.0210 2.2490 1.3536 2.6817 2.5104 2.2832 3.3932 2.7917 2.5864 2.9371 2.1611 2.5887 1.1533 1.9469 1.8590 2.2991 2.4380 1.5177 1.9089 1.3431 1.7564 1.5814 1.4537 2.8937 1.5529 1.5663 1.6414 1.9993 1.7943 2.3143 2.4599 1.7694 1.3561 1.4575 1.2128 1.6412 1.4024 1.3911 1.2669 1.2887 1.3270 1.4454 1.5014 1.8693 1.2736 1.2201 1.5789 1.1843 1.0835 1.0705 1.0632 1.0595 1.0887 1.0608 1.0623 4.9000 1.0826 1.0806 1.0660 1.0442 1.0528 1.0540 1.0648 1.0618 1.0965 1.1014 1.0974 1.1007 1.0982 1.0981 1.0629 1.0977 1.1129 1.0660
irintensity: 0.0791 0.1627 2.1682 0.3441 0.6525 0.0426 0.4608 5.2311 33.3243 97.9106 4.7142 4.6200 11.7160 1.7403 2.4442 3.7027 7.5278 3.3308 2.5491 0.5722 2.8710 2.8783 9.2671 2.5710 4.7025 18.3971 70.4716 7.6288 30.9800 9.2557 53.5307 1.4365 1.3597 1.9254 2.0766 6.0490 14.6530 3.0388 3.5071 19.9937 4.1083 7.8628 12.2665 5.7929 0.5867 5.9272 2.9587 5.5100 13.1642 1.1737 0.7774 12.1274 24.3741 10.4264 1.8454 8.4183 9.8563 9.2480 17.4055 4.5579 19.8051 12.0368 29.4438 24.7857 40.2581 19.8301 18.0641 45.0850 9.7015 79.5394 24.7846 37.1942 20.6200 55.5142 42.3087 73.4268 32.2055 8.7251 19.6693 26.7035 3.0521
temp: 298.150 k
press: 1.00000 atm
elementType: 8 6 6 6 6 6 6 6 6 6 6 1 1 1 1 1 1 1 1 1 1 1 1 1 1 1 1 1 1
symmnumber: 1
zpe: 676458.9 jmol-1
zpe.correction: 0.257650 hartree
zpe.thermalcorrener: 0.270137 hartree
zpe.thermalcorrenthalpy: 0.271081 hartree
zpe.thermalcorrgfe: 0.219363 hartree
zpe.sumelectzpe: -466.173487 hartree
zpe.sumelectthermal: -466.161000 hartree
zpe.sumelectthermalent: -466.160056 hartree
zpe.sumelectthermalfe: -466.211774 hartree
dipole: -1.4102 -0.5505 1.1290
dipole: 1.8885
quadrupole: -75.7118 -66.2149 -68.9545
quadrupole: -0.7702 0.7288 1.7326
quadrupole: -5.4180 4.0788 1.3392 -0.7702 0.7288 1.7326
hfenergy: -466.4311369 hartree
pointgroup: C01 [X(C10H18O1)]
dipole: -0.5547214 0.0647424 -0.4900216 debye
polarizability: 126.2285924|4.0463933|105.1621328|-4.016213|-13.0406174|93.586794 unknown
InChI: InChI=1S/C10H18O/c1-7(2)9-5-4-8(3)10(11)6-9/h8-11H,1,4-6H2,2-3H3
charge 0 multiplicity 1
29 atoms
O  2.327275 -1.86942 0.53595
C  1.989306 0.503366 0.178334
C  -0.959075 -0.026378 -0.313793
C  1.438447 -0.900916 -0.141214
C  -0.020559 -1.075503 0.328593
C  1.04208 1.576517 -0.418288
C  -0.4272 1.400325 0.028952
C  3.437708 0.678954 -0.321775
C  -2.438599 -0.189201 0.045587
C  -3.413979 0.606482 -0.809285
C  -2.883614 -0.986789 1.05389
H  1.980854 0.600755 1.284911
H  -0.880196 -0.133547 -1.421167
H  1.484652 -1.061575 -1.24502
H  -0.03799 -0.978238 1.432425
H  -0.375066 -2.098094 0.082016
H  1.0964 1.530469 -1.527048
H  1.405992 2.581531 -0.128552
H  -0.511155 1.553145 1.123992
H  -1.056155 2.171225 -0.455135
H  4.091143 -0.102053 0.100624
H  3.484767 0.605527 -1.426278
H  3.837062 1.669228 -0.032841
H  1.975855 -2.782984 0.381821
H  -3.255092 1.696849 -0.701863
H  -3.281392 0.369663 -1.883566
H  -4.460931 0.39073 -0.53619
H  -3.953101 -1.07229 1.280423
H  -2.206537 -1.577478 1.679396
