program: Gaussian 09
title: 000007848
version: EM64L-G09RevD.01
frameworkgroup: C1[X(C3H8S)]
method: RPBEPBE
basis: SDD
operation: Freq
keyword: #p
keyword: freq=noraman
keyword: PBEPBE/SDD
title: #p freq=noraman PBEPBE/SDD
converged: YES YES NO NO
title: Mulliken charges:
elementType: S C C C H H H H H H H H
charge: -0.029851 -0.302388 -0.670852 -0.667166 0.223084 0.201808 0.259578 0.252422 0.211890 0.221691 0.209367 0.090417
chargesum: 0.00000
title: Mulliken charges with hydrogens summed into heavy atoms:
elementType: S C C C
charge: 0.060566 0.122504 -0.158852 -0.024218
polarizability: 6.27681577e+01 -4.00372695e+00 4.16842740e+01 -7.19383771e-01 -4.03694058e+00 4.08681033e+01
1716.lowfreq: -10.4712 -0.0013 0.0017 0.0033 13.4913 41.8196 110.4362 197.3103 216.2083
frequency: 110.2207 197.2807 216.1571 238.1521 345.9727 668.4013 728.7278 789.9846 889.5042 903.7721 1042.6854 1088.1355 1116.1921 1223.1568 1260.7907 1286.0110 1332.3869 1388.3737 1451.0972 1472.5714 1476.5348 1484.5028 2431.8343 2976.7302 2987.3882 3022.2585 3039.3774 3073.4054 3078.6998 3097.7967
redmass: 2.3010 1.0897 1.5754 1.6450 4.2303 3.2365 1.1349 1.1504 1.5610 1.3353 2.7956 1.4644 1.8548 1.3309 1.2001 1.1019 1.4204 1.2049 1.0848 1.0571 1.0425 1.0766 1.0383 1.0353 1.0623 1.0586 1.0988 1.1012 1.0993 1.1070
irintensity: 0.8933 16.4739 0.7761 11.2617 1.0245 11.1105 5.6013 7.6297 9.1522 5.7207 2.0284 4.2549 9.7653 2.0891 4.5061 1.1877 1.5376 12.6915 3.2159 3.6857 14.0756 15.3732 32.8488 34.5417 17.7246 31.2025 2.0793 36.5377 43.4494 47.2125
temp: 298.150 k
press: 1.00000 atm
elementType: 16 6 6 6 1 1 1 1 1 1 1 1
symmnumber: 1
zpe: 265679.2 jmol-1
zpe.correction: 0.101192 hartree
zpe.thermalcorrener: 0.107289 hartree
zpe.thermalcorrenthalpy: 0.108233 hartree
zpe.thermalcorrgfe: 0.071982 hartree
zpe.sumelectzpe: -516.816554 hartree
zpe.sumelectthermal: -516.810457 hartree
zpe.sumelectthermalent: -516.809513 hartree
zpe.sumelectthermalfe: -516.845764 hartree
dipole: -1.8673 -0.1823 0.8853
dipole: 2.0745
quadrupole: -37.4798 -33.5580 -33.2118
quadrupole: -1.3612 1.7612 -1.5936
quadrupole: -2.7300 1.1919 1.5381 -1.3612 1.7612 -1.5936
hfenergy: -516.9177459 hartree
pointgroup: C01 [X(C3H8S1)]
dipole: -0.7388559 -0.0000871 -0.3467654 debye
dipolederiv: -0.3361572 0.0265765 0.0989953 -0.0338295 -0.1972877 -0.1488591 0.1659105 -0.1156627 0.0461089 -0.0472438 0.0039197 0.0164513 -0.1165571 0.0281587 -0.01159 -0.0202909 -0.0159547 0.1351015 0.4019568 0.0745307 0.0140762 0.1418217 0.1373499 0.0383702 -0.099391 -0.0143039 0.1029765 -0.119416 -0.0281692 0.0110101 0.0848418 0.0683987 -0.0004422 0.0047561 0.0057072 0.1082533 0.0426467 -0.0297941 -0.0397598 -0.0025483 -0.0174305 -0.103026 -0.0142566 -0.1247928 -0.0564776 0.0248008 -0.0353156 0.0423379 -0.0022216 -0.0159421 0.1062945 0.0326205 0.139581 -0.0831403 0.0288065 -0.0292436 0.0204734 -0.0027534 0.0102696 0.0895196 -0.0032208 0.1141486 -0.030761 -0.0494848 -0.068557 -0.0439179 -0.0268265 -0.0343216 -0.0904887 -0.0216111 -0.1305227 -0.0496808 0.0761323 -0.0131784 -0.0048557 -0.059248 0.001209 0.1231759 0.0439944 0.1293762 -0.0873841 -0.1238967 0.1075541 0.0045846 0.1391231 -0.0346806 0.0000086 0.0019272 0.001258 0.106252 0.0755692 -0.017343 -0.0024897 -0.0650334 -0.0082379 -0.1241253 -0.0476241 -0.1331968 -0.0837053 0.0262863 0.00902 -0.1169057 -0.0567688 0.0625145 0.1211625 -0.042814 0.1443625 -0.107543 unknown
polarizability: 62.4983295|4.7015615|40.8327718|0.0547388|-4.0389548|41.9894337 unknown
InChI: InChI=1S/C3H8S/c1-2-3-4/h4H,2-3H2,1H3
charge 0 multiplicity 1
12 atoms
S  2.227896 0.143704 0.030747
C  -0.630326 0.509786 -0.012798
C  0.466131 -0.568351 -0.025354
C  -2.04672 -0.110297 0.012252
H  -0.484403 1.162813 0.868088
H  -0.52239 1.155829 -0.906823
H  0.412124 -1.203723 0.875865
H  0.38574 -1.220144 -0.912316
H  -2.19456 -0.729937 0.916404
H  -2.821095 0.677997 0.012936
H  -2.21992 -0.753863 -0.870713
H  2.140123 0.839986 -1.165288
