program: Gaussian 09
title: 000007844
version: EM64L-G09RevD.01
frameworkgroup: C1[X(C4H8)]
method: RPBEPBE
basis: SDD
operation: Freq
keyword: #p
keyword: freq=noraman
keyword: PBEPBE/SDD
title: #p freq=noraman PBEPBE/SDD
converged: YES YES NO NO
title: Mulliken charges:
elementType: C C C C H H H H H H H H
charge: -0.434352 -0.666996 -0.014878 -0.583842 0.207652 0.204589 0.215992 0.224079 0.210335 0.207072 0.214020 0.216327
chargesum: 0.00000
title: Mulliken charges with hydrogens summed into heavy atoms:
elementType: C C C C
charge: -0.022111 -0.016589 0.192195 -0.153494
polarizability: 5.71656831e+01 -7.90526935e-01 3.69751974e+01 6.59015648e+00 -3.44435337e+00 3.45971067e+01
1716.lowfreq: -33.0140 -18.9036 -4.8232 0.0002 0.0004 0.0008 96.1462 221.9050 303.8920
frequency: 96.0438 221.8944 303.8857 421.2432 635.3309 785.1815 847.8979 939.7273 969.2610 1000.0634 1028.6182 1070.9662 1181.4893 1254.1168 1282.2444 1308.1487 1385.0927 1426.5827 1463.2300 1475.0354 1485.1603 1657.9746 2966.7131 2979.1240 3029.9354 3069.5948 3076.9014 3084.9895 3090.8529 3193.5790
redmass: 2.2425 1.0870 1.8100 2.0006 1.4760 1.1777 1.9304 1.3251 1.1736 1.1105 2.5598 1.7248 1.9641 1.1833 1.2416 1.3884 1.2012 1.1819 1.0797 1.0442 1.0636 4.7477 1.0621 1.0356 1.0967 1.0847 1.0926 1.0989 1.0772 1.1145
irintensity: 0.1459 0.0599 0.9323 0.9924 15.1089 7.2250 2.7359 87.3416 10.4434 15.7511 0.7478 4.8089 0.2140 0.1984 0.1373 0.6708 9.5444 4.7298 8.8406 10.7215 12.1911 16.8856 37.2504 34.6373 8.1383 4.6272 76.3769 53.1783 7.2874 33.0329
temp: 298.150 k
press: 1.00000 atm
elementType: 6 6 6 6 1 1 1 1 1 1 1 1
symmnumber: 1
zpe: 279512.7 jmol-1
zpe.correction: 0.106461 hartree
zpe.thermalcorrener: 0.111831 hartree
zpe.thermalcorrenthalpy: 0.112775 hartree
zpe.thermalcorrgfe: 0.078784 hartree
zpe.sumelectzpe: -156.861915 hartree
zpe.sumelectthermal: -156.856544 hartree
zpe.sumelectthermalent: -156.855600 hartree
zpe.sumelectthermalfe: -156.889591 hartree
dipole: 0.4699 0.0205 0.1128
dipole: 0.4837
quadrupole: -26.0556 -25.6703 -27.0988
quadrupole: 0.5866 0.9365 -1.4389
quadrupole: 0.2193 0.6046 -0.8239 0.5866 0.9365 -1.4389
hfenergy: -156.9683753 hartree
pointgroup: C01 [X(C4H8)]
dipole: 0.1847324 0.0409185 0.020344 debye
dipolederiv: -0.0569198 -0.005581 0.0276136 -0.021706 0.1546659 0.0399232 -0.006748 0.0144988 0.0935036 -0.0016796 0.0419293 -0.0198788 0.0033839 0.043952 0.0205578 0.0497226 0.0364431 0.0839776 0.2264314 0.1239152 -0.0101149 0.1820502 -0.1894771 0.0335552 -0.1162139 0.024867 0.163002 -0.2212337 0.0880247 -0.0770634 0.058608 -0.4082424 0.0184505 -0.0896421 0.0111087 0.0833667 0.0194675 0.008715 -0.0629738 0.0156209 0.0806101 -0.0332254 -0.0069217 0.009501 -0.1791308 -0.002297 -0.0631025 -0.0044959 -0.056895 -0.1720582 -0.0203476 0.0284212 -0.0468434 0.0878996 -0.1854654 -0.0346982 0.0861564 -0.0420087 0.0735082 0.0407174 0.1096644 0.037882 0.040103 0.0753891 -0.0536786 -0.0216974 0.007804 -0.1609495 -0.0335366 -0.0218063 -0.0473133 0.0807911 0.0874656 0.0203531 -0.0129489 0.0086501 0.0747371 -0.0369716 -0.0675171 -0.0075494 -0.1813308 0.0466934 -0.0293779 -0.017553 -0.0417862 0.1409111 -0.0200612 0.0343255 -0.0167633 -0.1640451 -0.0752036 -0.067277 0.0870245 -0.082382 0.1848843 0.0096597 0.0984857 0.013627 0.0225278 0.0873521 -0.0292222 0.0259315 -0.0313392 0.1774585 -0.0187214 -0.0117705 -0.0294583 -0.1306648 unknown
polarizability: 56.9544024|5.1941924|32.2043799|4.3866628|1.4130254|39.5792049 unknown
InChI: InChI=1S/C4H8/c1-3-4-2/h3H,1,4H2,2H3
charge 0 multiplicity 1
12 atoms
C  0.635174 0.458792 -0.33158
C  1.805518 -0.433264 0.158665
C  -0.667826 0.138824 0.372391
C  -1.817199 -0.249065 -0.236095
H  0.506701 0.345761 -1.42479
H  0.898418 1.521419 -0.148299
H  2.750724 -0.15842 -0.344323
H  1.599954 -1.498585 -0.048589
H  1.957405 -0.324253 1.248882
H  -0.649213 0.227112 1.471024
H  -2.725894 -0.470973 0.335211
H  -1.880862 -0.354947 -1.326496
