program: Gaussian 09
title: 000089669
version: EM64L-G09RevD.01
frameworkgroup: C1[X(C11H20O3)]
method: RPBEPBE
basis: SDD
operation: Freq
keyword: #pfreq=noraman
keyword: PBEPBE/SDD
title: #p freq=noraman PBEPBE/SDD
converged: YES YES NO NO
title: Mulliken charges:
elementType: O O O C C C C C C C C C C C H H H H H H H H H H H H H H H H H H H H
charge: -0.188741 -0.252575 -0.245224 -0.369278 -0.372625 -0.376098 -0.352518 -0.511820 -0.356351 0.198231 -0.696449 -0.590114 0.267296 -0.504560 0.186351 0.193942 0.191791 0.191560 0.218324 0.211762 0.187840 0.186931 0.283892 0.229896 0.195512 0.195391 0.215488 0.209759 0.209375 0.274986 0.240960 0.238303 0.242915 0.245850
chargesum: 0.00000
title: Mulliken charges with hydrogens summed into heavy atoms:
elementType: O O O C C C C C C C C C C C
charge: -0.188741 -0.252575 -0.245224 0.011015 0.010725 0.053987 0.022252 0.001968 0.034552 0.198231 -0.061828 -0.074168 0.267296 0.222509
polarizability: 1.66003340e+02 3.57199556e+00 1.17726980e+02 4.42270564e+00 -3.95114049e+00 1.06979151e+02
1716.lowfreq: -28.8694 -2.0408 -0.0004 -0.0002 0.0005 4.0170 7.3796 20.6087 28.9571
frequency: -24.4642 19.9363 28.9148 45.0831 57.9507 69.2719 81.4466 85.4263 117.8082 134.8537 140.2254 150.8309 183.2331 216.5650 226.8296 256.1976 277.2759 353.5459 406.5245 412.5183 467.7611 486.9293 542.6659 631.0467 689.3095 719.2165 727.2166 757.3710 798.7026 820.1469 844.7057 888.3138 904.4477 926.7109 959.6289 992.2951 1000.6038 1031.2714 1051.3818 1071.0549 1081.1509 1084.9830 1100.3344 1112.6097 1120.5504 1133.6665 1148.8876 1185.7293 1209.8942 1222.8046 1232.9299 1262.6776 1274.0183 1279.8863 1281.1389 1291.7636 1293.1280 1317.0868 1347.6794 1355.8473 1364.5406 1388.6942 1420.8396 1430.9164 1438.6707 1452.1559 1461.0143 1462.0330 1462.4386 1467.0681 1474.6952 1476.8717 1482.5416 1488.0495 1624.0597 1643.0311 2948.3824 2950.2782 2950.8407 2958.6731 2967.9797 2971.0041 2984.9394 2989.3538 2994.5957 2998.8303 3007.4329 3014.4525 3018.5153 3033.4682 3053.8723 3067.3437 3069.9078 3110.6582 3125.5180 3154.7624
redmass: 1.7126 3.7299 4.8588 4.9027 3.8009 2.4188 1.9481 1.1631 3.0896 1.8995 2.8793 3.1064 4.2821 4.3836 1.1261 3.8586 3.4332 4.3395 2.3627 3.3878 3.2189 2.7759 4.6518 3.9340 2.7486 1.0942 1.2011 1.3797 2.1782 2.6657 2.1263 1.8948 1.4590 2.0828 4.9565 1.2152 4.2157 3.0235 3.2546 2.0620 2.1397 2.1109 1.5114 1.2758 2.6148 3.1574 1.4376 1.7312 1.4958 1.3515 1.3939 1.3099 1.2768 1.1261 1.3846 1.0983 1.1318 1.4270 1.5563 1.6663 1.7335 1.2176 1.1803 1.0947 1.0952 1.0501 1.0727 1.0689 1.0508 1.0760 1.0769 1.0427 1.0826 1.0896 8.7477 8.4527 1.0625 1.0595 1.0590 1.0592 1.0584 1.0369 1.0967 1.0606 1.0981 1.0954 1.0295 1.1030 1.0627 1.1043 1.1032 1.1007 1.0992 1.1047 1.0996 1.1049
irintensity: 0.1102 0.4768 1.9436 2.4015 2.7890 1.2271 0.2960 0.5580 0.0687 0.0100 2.3015 1.3053 5.9024 6.4130 0.0028 1.0682 21.6262 1.5347 2.9720 5.2217 3.4687 0.1313 8.1550 8.5428 6.0856 13.7396 1.8343 4.8116 8.3627 2.9358 1.3503 2.9971 4.7528 12.5600 13.2120 2.0687 0.2780 4.1659 2.0177 36.9899 1.2312 25.9633 2.1442 0.0108 48.9004 341.4262 11.3943 1.6718 34.8363 38.5583 5.6936 41.1226 19.7423 7.6884 83.3303 6.9713 1.7648 11.7069 15.4312 0.7754 21.3826 11.8428 21.1115 27.9179 28.2144 14.9722 0.0474 0.2760 12.4950 1.9021 1.5074 12.3092 5.1313 25.0454 259.2136 49.9767 7.1066 4.3342 3.5827 27.7871 110.7099 34.1146 1.2101 34.3065 1.4826 1.1464 28.6847 0.8732 3.8253 58.9424 75.0761 100.7311 54.9559 24.5693 2.5877 14.6675
temp: 298.150 k
press: 1.00000 atm
elementType: 8 8 8 6 6 6 6 6 6 6 6 6 6 6 1 1 1 1 1 1 1 1 1 1 1 1 1 1 1 1 1 1 1 1
symmnumber: 1
zpe: 764535.8 jmol-1
zpe.correction: 0.291196 hartree
zpe.thermalcorrener: 0.308248 hartree
zpe.thermalcorrenthalpy: 0.309192 hartree
zpe.thermalcorrgfe: 0.243157 hartree
zpe.sumelectzpe: -655.702088 hartree
zpe.sumelectthermal: -655.685036 hartree
zpe.sumelectthermalent: -655.684092 hartree
zpe.sumelectthermalfe: -655.750127 hartree
dipole: -1.0659 -1.2965 1.3433
dipole: 2.1498
quadrupole: -73.2616 -92.2572 -85.3683
quadrupole: 7.6009 -0.5739 8.9305
quadrupole: 10.3675 -8.6282 -1.7393 7.6009 -0.5739 8.9305
hfenergy: -655.9932838 hartree
pointgroup: C01 [X(C11H20O3)]
dipole: -0.4094804 0.6305809 0.387344 debye
polarizability: 166.3734591|1.5878309|108.6974826|-2.7772171|5.8797585|115.6385294 unknown
InChI: InChI=1S/C11H20O3/c1-3-4-5-6-7-8-10(12)9-11(13)14-2/h3-9H2,1-2H3
charge 0 multiplicity 1
34 atoms
O  -1.572586 -1.010992 -2.101179
O  -4.696917 0.055421 0.154361
O  -2.888762 1.1070 1.180103
C  2.119683 0.527084 -0.247495
C  3.384488 -0.360963 -0.244593
C  0.889624 -0.18011 -0.857374
C  4.621079 0.336232 0.36528
C  -0.369774 0.704857 -0.828223
C  5.883384 -0.556254 0.375277
C  -1.599781 0.068351 -1.459104
C  7.113979 0.146074 0.988629
C  -2.939385 0.831543 -1.282298
C  -3.465719 0.705765 0.141428
C  -5.301922 -0.148603 1.495996
H  2.330474 1.459718 -0.812607
H  1.890842 0.839288 0.793008
H  3.173966 -1.293443 0.319761
H  3.614974 -0.673542 -1.284566
H  1.10365 -0.481942 -1.900523
H  0.686106 -1.118886 -0.305931
H  4.390147 0.652373 1.404335
H  4.83698 1.266585 -0.20117
H  -0.636173 1.007128 0.205959
H  -0.183015 1.66162 -1.364913
H  5.666478 -1.485838 0.940242
H  6.11474 -0.871084 -0.662857
H  8.002259 -0.512222 0.982777
H  6.919555 0.442228 2.036934
H  7.369253 1.063063 0.42424
H  -3.679142 0.433279 -1.991439
H  -2.764345 1.906256 -1.476825
H  -6.24999 -0.666483 1.297178
H  -5.471711 0.823098 1.989126
H  -4.63464 -0.763101 2.122864
