program: Gaussian 09
title: 000089599
version: EM64L-G09RevD.01
frameworkgroup: C1[X(C8H6BrN)]
method: RPBEPBE
basis: SDD
operation: Freq
keyword: #p
keyword: freq=noraman
keyword: PBEPBE/SDD
title: #p freq=noraman PBEPBE/SDD
converged: YES YES NO NO
title: Mulliken charges:
elementType: Br N C C C C C C C C H H H H H H
charge: -0.012357 -0.013013 0.376796 0.281079 -0.322404 -0.858151 -0.355100 -0.220632 -0.215496 -0.259002 0.246699 0.308259 0.295881 0.262465 0.241118 0.243859
chargesum: 0.00000
title: Mulliken charges with hydrogens summed into heavy atoms:
elementType: Br N C C C C C C C C
charge: -0.012357 -0.013013 0.376796 0.281079 -0.075705 -0.254011 -0.092635 0.020486 0.028362 -0.259002
polarizability: 1.32275375e+02 -1.10896626e+01 1.21243169e+02 -4.75413840e+00 -2.02802527e+00 6.12008800e+01
1716.lowfreq: -6.9971 -0.0008 -0.0007 -0.0003 1.6472 9.2168 38.5678 81.9499 128.0564
frequency: 38.4936 81.9395 128.0558 149.6088 231.0140 325.4325 380.3336 431.1919 465.2854 540.2594 559.8919 585.1977 590.9769 714.8562 764.8646 777.2425 827.1148 880.8711 893.9539 969.4638 1002.5994 1037.9374 1074.1377 1134.9368 1180.7807 1191.0379 1215.3604 1231.7532 1290.9277 1378.4845 1436.7992 1460.8635 1479.4426 1576.0748 1606.5944 2177.3453 3071.7534 3135.8601 3147.9502 3155.8848 3161.1066 3176.3919
redmass: 8.1777 6.5139 5.8160 6.1505 6.7467 2.6872 4.3690 4.8905 6.3076 6.1845 4.4557 4.6491 5.7496 5.3622 3.9813 1.2871 4.5172 1.5592 1.4453 1.3952 1.3529 2.2656 1.7023 1.2892 1.0621 2.3716 1.2605 2.4254 1.4728 7.6898 2.2536 1.1403 2.6128 6.5400 6.2151 12.6345 1.0575 1.0875 1.0896 1.1111 1.0950 1.1009
irintensity: 0.9675 1.5586 0.5110 4.3144 3.1690 1.7140 0.1708 1.2699 11.4096 9.7429 29.5428 23.4979 3.3132 2.2025 1.7192 75.5677 5.6089 2.9222 0.6165 2.3987 0.0384 3.3924 3.2916 0.4847 0.2337 2.5659 33.0645 15.2118 2.4742 4.0418 4.7730 10.7716 8.8053 0.7818 3.0114 19.0571 9.3822 2.2371 3.7396 0.7264 12.5145 14.8575
temp: 298.150 k
press: 1.00000 atm
elementType: 35 7 6 6 6 6 6 6 6 6 1 1 1 1 1 1
symmnumber: 1
zpe: 303014.5 jmol-1
zpe.correction: 0.115412 hartree
zpe.thermalcorrener: 0.124411 hartree
zpe.thermalcorrenthalpy: 0.125355 hartree
zpe.thermalcorrgfe: 0.079106 hartree
zpe.sumelectzpe: -375.954692 hartree
zpe.sumelectthermal: -375.945693 hartree
zpe.sumelectthermalent: -375.944749 hartree
zpe.sumelectthermalfe: -375.990999 hartree
dipole: 3.4467 -4.0182 1.1089
dipole: 5.4088
quadrupole: -61.0397 -75.3825 -65.9604
quadrupole: -2.4182 -4.7504 -1.7953
quadrupole: 6.4212 -7.9216 1.5004 -2.4182 -4.7504 -1.7953
hfenergy: -376.0701042 hartree
pointgroup: C01 [X(C8H6Br1N1)]
dipole: -2.0273583 -0.3632488 -0.5349268 debye
dipolederiv: -0.3600063 0.2475769 -0.0788705 0.2513679 -0.3471752 0.1062278 -0.2925717 0.2873894 -0.3023019 -0.3165923 -0.0918797 0.0126903 -0.059671 -0.2826371 0.0110383 0.0128476 0.0042084 -0.2335097 0.0072962 -0.0139414 0.0024248 0.0884306 0.0086828 0.0112657 0.1114952 -0.0597908 -0.1305284 -0.0338738 -0.0316491 -0.0084026 -0.0752795 0.123383 -0.0111558 -0.0325984 0.0365322 0.1147991 -0.19746 0.0177483 -0.0017246 0.0679776 0.0911218 0.0628412 0.0106614 0.033577 -0.109554 0.4373126 -0.3932975 0.203768 -0.3157393 0.3970627 -0.2021219 0.2911214 -0.2923996 0.4473461 -0.1050661 0.1169519 -0.0182082 -0.0658317 0.0653546 0.0484794 -0.0073954 0.0174865 -0.1068226 0.1302235 0.0620068 -0.0079281 0.0522779 -0.0181015 0.0259512 -0.019552 0.0061921 -0.112769 0.0751228 -0.116398 -0.0625562 -0.0521547 -0.0956336 0.0476271 -0.0482493 0.0309256 -0.1211915 0.2459148 0.2000311 -0.0062432 0.1283443 0.0689884 -0.0363906 -0.0057648 -0.0138536 0.0135671 0.090386 0.0076929 0.020927 -0.0174647 -0.0719499 -0.0454025 -0.0018736 -0.0426918 0.1293994 0.0015233 0.0304808 -0.0103776 -0.0438023 0.0217703 0.0976664 -0.0173646 0.0942381 0.0033271 0.0394837 -0.0132284 -0.0997476 0.0470897 -0.0207253 -0.0266471 -0.0726961 -0.0111536 -0.0463908 0.0930053 -0.0237016 0.002594 -0.0037615 -0.0425852 -0.0406598 0.013715 -0.0432073 0.154248 -0.0661233 -0.0665886 0.0086614 -0.0812478 0.0582827 -0.0129161 0.0140305 -0.013636 0.153743 -0.0411464 0.0681956 0.0429931 0.0794645 0.0441616 -0.0358032 0.0441948 -0.0338166 0.146638 unknown
polarizability: 138.3468111|-3.9614865|115.2157382|3.9073752|-3.5374737|61.156874 unknown
InChI: InChI=1S/C8H6BrN/c9-5-7-3-1-2-4-8(7)6-10/h1-4H,5H2
charge 0 multiplicity 1
16 atoms
Br 2.028173 -2.39496 0.933089
N  2.402838 1.973877 -0.133696
C  0.001265 -0.678696 -0.354745
C  0.086735 0.717155 -0.048479
C  -1.271177 -1.300184 -0.313202
C  1.218537 -1.471592 -0.720341
C  -1.081787 1.451256 0.29183
C  -2.429921 -0.570048 0.024682
C  -2.334915 0.808431 0.329683
C  1.35464 1.399342 -0.092563
H  -1.345393 -2.370337 -0.53732
H  2.047491 -0.861126 -1.104316
H  0.997091 -2.309969 -1.394815
H  -0.995033 2.51768 0.521088
H  -3.402777 -1.07166 0.050571
H  -3.231765 1.37783 0.593631
