program: Gaussian 09
title: 000089622
version: EM64L-G09RevD.01
frameworkgroup: C1[X(C11H12BrNO)]
method: RPBEPBE
basis: SDD
operation: Freq
keyword: #p
keyword: freq=noraman
keyword: PBEPBE/SDD
title: #p freq=noraman PBEPBE/SDD
converged: YES YES NO NO
title: Mulliken charges:
elementType: Br O N C C C C C C C C C C C H H H H H H H H H H H H
charge: -0.007136 -0.273031 -0.206808 -0.407181 -0.522072 -0.422868 0.327624 0.258712 -0.316686 -0.328013 0.218025 -0.240440 -0.207543 -0.819640 0.213264 0.228699 0.227257 0.238913 0.232136 0.247174 0.249906 0.308955 0.250203 0.239348 0.273346 0.237855
chargesum: 0.00000
title: Mulliken charges with hydrogens summed into heavy atoms:
elementType: Br O N C C C C C C C C C C C
charge: -0.007136 -0.273031 -0.206808 0.034782 -0.055902 0.056443 0.327624 0.258712 -0.066780 -0.019059 0.218025 -0.240440 0.042660 -0.069091
polarizability: 2.23242110e+02 2.26897761e+00 1.43474751e+02 -1.12028147e+00 6.79351709e-01 7.28684263e+01
1716.lowfreq: -7.8072 -0.0006 0.0002 0.0004 1.5382 8.4226 39.0504 53.4876 77.8404
frequency: 39.0478 53.4675 77.8311 135.4571 164.9977 183.5037 209.6398 234.3005 262.7546 330.5709 357.3383 375.6281 399.7830 444.4294 454.9447 469.0350 535.2580 567.2565 579.6989 580.6115 620.7636 684.7338 715.4680 798.0356 823.4673 844.6297 858.7160 894.6348 920.4575 957.3880 959.8590 1011.1125 1028.0520 1046.3503 1078.1008 1085.6113 1122.3974 1131.8482 1180.8965 1192.9128 1208.2631 1236.6484 1260.2990 1282.2535 1327.8368 1339.7624 1355.5499 1363.6062 1374.4324 1382.3280 1402.5516 1454.0859 1456.3788 1466.3920 1471.7827 1477.8889 1495.5127 1570.0792 1584.7094 1600.5103 2970.0874 2981.3808 2988.7420 3003.8883 3036.2198 3068.0486 3076.2337 3127.8083 3135.5434 3143.0056 3167.8090 3211.1822
redmass: 4.2824 4.1519 3.4595 6.5676 3.4123 3.7862 9.9650 1.1358 3.0723 3.2817 3.9445 3.3522 3.5904 3.2291 4.0153 3.3985 3.5504 4.5507 3.4538 4.1857 2.7429 4.8899 3.6585 4.6275 1.4561 2.3890 1.7144 1.4537 2.5865 1.9913 1.5146 1.8374 1.6612 2.2760 2.1989 2.1104 2.8967 1.8339 1.3297 1.4712 1.9128 2.3723 1.3742 1.5285 1.5885 2.0903 1.4142 1.6369 4.0619 1.3513 3.3786 1.1537 1.1450 1.1315 1.2385 1.5416 1.0921 7.4601 6.4272 7.5751 1.0650 1.0723 1.0384 1.0619 1.0945 1.1037 1.0985 1.0975 1.0910 1.0922 1.0918 1.0938
irintensity: 1.1890 3.9239 1.4140 1.0708 2.5749 0.5680 0.2113 1.2338 8.5089 3.6980 2.7210 2.7895 4.3504 6.7647 6.2982 0.8732 6.5438 8.9831 4.5562 4.4439 2.1238 11.4231 0.5731 31.2997 43.2680 7.1148 5.7526 16.5845 3.9499 32.7845 13.5779 11.4306 5.3124 15.8321 4.4760 18.8987 9.8927 10.0825 33.4401 44.8907 29.3949 12.8463 66.2997 26.6091 6.2715 241.9879 7.3978 17.8406 4.7970 73.8873 3.5370 11.8197 42.7652 29.7758 45.1866 133.4463 21.2599 11.3796 146.7853 51.8489 20.2724 38.6039 10.0276 30.3214 25.3098 43.5710 14.8252 12.6902 14.4181 4.6942 2.7428 8.2146
temp: 298.150 k
press: 1.00000 atm
elementType: 35 8 7 6 6 6 6 6 6 6 6 6 6 6 1 1 1 1 1 1 1 1 1 1 1 1
symmnumber: 1
zpe: 540902.3 jmol-1
zpe.correction: 0.206019 hartree
zpe.thermalcorrener: 0.218828 hartree
zpe.thermalcorrenthalpy: 0.219773 hartree
zpe.thermalcorrgfe: 0.165289 hartree
zpe.sumelectzpe: -568.797885 hartree
zpe.sumelectthermal: -568.785076 hartree
zpe.sumelectthermalent: -568.784132 hartree
zpe.sumelectthermalfe: -568.838616 hartree
dipole: -3.8706 4.3187 1.1200
dipole: 5.9066
quadrupole: -84.1217 -90.9615 -94.2529
quadrupole: -9.8275 -3.3466 -2.8736
quadrupole: 5.6570 -1.1828 -4.4742 -9.8275 -3.3466 -2.8736
hfenergy: -569.0039043 hartree
pointgroup: C01 [X(C11H12Br1N1O1)]
dipole: 1.3818106 -1.8036916 0.4872925 debye
dipolederiv: -0.8530111 0.092712 0.0112386 0.0643089 -0.0859906 -0.0026428 0.0032832 0.001025 -0.0497421 -0.6112931 0.1043448 -0.0553227 -0.4078474 -1.0407577 0.2489248 0.1729131 0.2565762 -0.4177169 -1.5534615 -0.3571627 0.1111207 -0.4232455 -0.7904709 0.1425862 0.1642441 0.1405807 -0.2654018 0.0668494 -0.0499381 -0.0105399 -0.0121458 -0.0007991 -0.028177 -0.0501923 -0.0287062 0.0783302 0.0329351 -0.0129657 -0.0021475 0.0281544 0.010432 -0.0083387 -0.0064061 0.0198267 0.1680581 0.0857871 -0.1270988 0.0253249 -0.2228169 0.4549836 -0.0924041 0.0183857 -0.109579 0.3118338 -0.1331702 -0.0726313 0.0148146 -0.1173128 0.2272749 -0.0028456 0.0855625 -0.0287136 -0.0706614 1.119635 0.0148639 -0.0199885 -0.0891927 -0.1249863 0.0645478 0.0202179 0.0695138 0.0494123 -0.3539114 0.1889215 0.0026243 0.0909099 -0.0399723 -0.0069673 0.0053757 0.0000638 -0.1163221 -0.143903 0.0128072 -0.0036512 0.0479184 -0.017265 0.0006615 -0.0689722 -0.0165378 -0.1334628 1.4234751 0.3448297 -0.0841284 0.909835 1.3380462 -0.4410141 -0.2456703 -0.4302856 0.2840129 1.3477262 -0.1614595 -0.0076137 -0.0923484 0.0337341 0.0049506 -0.0094615 -0.0000694 -0.1259443 -0.3832526 -0.0313446 0.0032525 0.0250542 0.0449375 0.009148 -0.0181069 -0.0138131 -0.1064033 -0.4551699 0.0277639 -0.0148925 0.1155657 -0.0110381 0.0225829 -0.0455092 0.0210475 0.0539255 -0.0045375 0.0982038 -0.0091797 0.1131022 -0.1606338 0.0324196 -0.0363807 0.0490408 0.0807667 0.0323323 -0.0162343 0.0281814 -0.0497792 0.0909691 0.0547829 0.0532594 -0.0022822 -0.1288956 0.0321761 0.0502964 0.0312735 0.02588 -0.0296102 0.0660798 0.0408081 0.1151273 -0.0824695 -0.0208049 -0.0569491 -0.0768807 -0.0294297 -0.0184361 -0.0658715 -0.0662301 -0.1144917 0.0070711 0.102487 -0.022206 0.0680547 0.0346739 -0.033708 0.0255475 -0.0148473 0.06785 -0.1496974 -0.1300983 0.0338255 -0.0076922 0.011124 0.0758751 -0.0001719 0.020321 -0.0052536 0.0800056 0.0539688 -0.0652054 -0.0009515 -0.0840355 -0.0225438 -0.0062093 -0.0054307 -0.007724 0.1462198 0.1456279 -0.0528298 -0.0088049 0.004175 0.0683939 -0.0115802 -0.0231557 0.012522 0.1687732 0.061494 0.060275 0.0044273 0.0673858 -0.0242386 -0.0078567 0.0138241 -0.000142 0.1578698 0.0322855 0.015422 -0.0062035 0.0419467 0.0921387 0.0720106 -0.0615756 0.0641114 -0.0808897 0.0627495 -0.038661 0.0076122 -0.1253917 -0.0264007 0.038749 0.0243246 0.0419571 0.1160455 0.0430844 0.0204207 0.0000723 0.0735114 -0.009934 -0.1089118 0.0294192 -0.1016439 0.0252823 unknown
polarizability: 222.9425559|-4.9141695|143.4514494|-3.4875245|-4.1407635|73.1912821 unknown
InChI: InChI=1S/C11H12BrNO/c1-8(14)13-6-2-3-9-7-10(12)4-5-11(9)13/h4-5,7H,2-3,6H2,1H3
charge 0 multiplicity 1
26 atoms
Br -4.727572 0.611736 0.076839
O  2.023032 2.149616 -0.670653
N  1.485076 -0.011406 0.092555
C  1.275092 -2.453793 -0.325652
C  -0.233756 -2.431577 -0.026472
C  1.96457 -1.358142 0.5077
C  -0.787172 -1.010156 0.01834
C  0.048695 0.150733 0.05729
C  -2.193926 -0.849722 0.026566
C  -0.559679 1.437613 0.095615
C  2.394241 1.007029 -0.263496
C  -2.769127 0.429976 0.070219
C  -1.960566 1.581702 0.103301
C  3.890784 0.702869 -0.141896
H  1.706139 -3.440919 -0.077525
H  1.464694 -2.262853 -1.398413
H  -0.420321 -2.922523 0.950626
H  -0.788481 -3.021154 -0.77967
H  1.738297 -1.508548 1.582927
H  3.052857 -1.41082 0.383022
H  -2.830534 -1.740363 -0.008275
H  0.069384 2.32667 0.096495
H  -2.404725 2.580324 0.133709
H  4.181393 0.393821 0.878293
H  4.418571 1.634963 -0.391192
H  4.219934 -0.080676 -0.849055
