program: Gaussian 09
title: 000089575
version: EM64L-G09RevD.01
frameworkgroup: C1[X(C12H9NS)]
method: RPBEPBE
basis: SDD
operation: Freq
keyword: #p
keyword: freq=noraman
keyword: PBEPBE/SDD
title: #p freq=noraman PBEPBE/SDD
converged: NO YES NO YES
title: Mulliken charges:
elementType: S N C C C C C C C C C C C C H H H H H H H H H
charge: 0.210538 -0.011539 0.459862 -0.594336 0.404976 0.307435 -0.441693 -0.369821 -0.416764 -0.427439 -0.095804 -0.242702 -0.242939 -0.733804 0.241133 0.257878 0.245300 0.242622 0.230554 0.230192 0.242965 0.260411 0.242976
chargesum: 0.00000
title: Mulliken charges with hydrogens summed into heavy atoms:
elementType: S N C C C C C C C C C C C C
charge: 0.210538 -0.011539 0.459862 -0.594336 0.404976 0.307435 -0.200561 -0.111943 -0.171464 -0.184817 -0.095804 -0.012149 -0.012747 0.012548
polarizability: 2.45549765e+02 5.47478331e+00 1.63967777e+02 2.72279535e-03 -4.08558612e-03 6.14905975e+01
1716.lowfreq: -7.8930 -3.4721 -0.0020 -0.0019 -0.0013 9.4748 70.8959 83.5523 119.4270
frequency: 70.8567 83.5501 119.4256 173.5300 184.2901 229.8641 294.3166 327.8458 380.8405 414.5659 418.6704 497.0156 497.4494 539.7418 540.5019 555.8961 570.6981 589.2450 656.9959 689.6963 742.5394 761.1168 791.1170 815.7644 830.7302 883.5161 935.5314 957.1535 974.2692 976.0748 991.3422 1014.6290 1035.5585 1036.5550 1112.7786 1139.2719 1147.4452 1175.6200 1232.3683 1260.9474 1275.6516 1338.6762 1388.1999 1392.6424 1409.9733 1434.3486 1444.8032 1455.6783 1456.1801 1516.5887 1552.1224 1561.4444 1600.8188 1630.3751 2991.1304 3071.7229 3116.5007 3123.6826 3129.0101 3136.7404 3145.7263 3164.8070 3172.9260
redmass: 1.1031 3.4854 5.4944 4.3579 3.9932 4.3476 4.0881 4.6400 5.8684 8.1667 3.1118 5.7923 4.1821 3.6315 6.1742 6.0309 4.1895 6.5715 6.7966 3.3147 6.7492 1.3260 3.2476 5.3825 1.4747 1.7037 5.7412 1.3546 2.8033 1.3771 1.3497 3.4610 1.4207 2.3899 1.9605 1.6283 1.6410 1.0812 1.7708 2.1611 2.8312 2.2733 4.8400 1.2494 3.8507 3.6304 2.4185 1.0445 1.1000 4.1611 7.2357 6.7317 6.9289 6.8653 1.0368 1.0978 1.0990 1.0858 1.0891 1.0888 1.0949 1.1005 1.0964
irintensity: 0.9373 1.3763 0.0323 1.6354 1.0269 5.8693 2.2883 0.6536 0.4078 0.0840 7.7201 2.7362 0.2758 6.4255 18.4568 16.9755 0.5472 7.1129 6.9226 0.7802 3.1116 52.1360 3.8267 3.6503 77.9282 6.5678 14.1026 2.7795 6.5534 1.1256 0.1228 0.5010 2.8154 6.8273 37.5879 10.8822 12.6344 0.3319 3.5373 23.5349 1.5776 12.7536 6.2977 12.3770 5.0469 1.7697 5.8013 20.5345 19.6666 8.6563 14.7448 30.2183 5.5289 3.5132 18.4393 11.8447 5.6111 2.9054 1.5248 6.6773 26.9090 32.6064 9.9659
temp: 298.150 k
press: 1.00000 atm
elementType: 16 7 6 6 6 6 6 6 6 6 6 6 6 6 1 1 1 1 1 1 1 1 1
symmnumber: 1
zpe: 455532.4 jmol-1
zpe.correction: 0.173503 hartree
zpe.thermalcorrener: 0.184625 hartree
zpe.thermalcorrenthalpy: 0.185569 hartree
zpe.thermalcorrgfe: 0.136245 hartree
zpe.sumelectzpe: -914.559027 hartree
zpe.sumelectthermal: -914.547905 hartree
zpe.sumelectthermalent: -914.546961 hartree
zpe.sumelectthermalfe: -914.596285 hartree
dipole: -0.3657 -0.7890 0.0000
dipole: 0.8696
quadrupole: -71.8455 -82.3424 -93.6072
quadrupole: -4.7332 0.0003 -0.0006
quadrupole: 10.7529 0.2560 -11.0088 -4.7332 0.0003 -0.0006
hfenergy: -914.73253 hartree
pointgroup: C01 [X(C12H9N1S1)]
dipole: 0.1651121 -0.299665 -0.0000021 debye
dipolederiv: -0.5079759 0.0897911 0.0000206 0.052683 -0.4067926 -0.0000316 0.0000178 -0.0000598 0.0623291 -0.4729505 -0.114181 0.0000023 -0.045925 -0.7388195 -0.0000394 0.0000275 0.0000266 -0.1842249 0.1073812 -0.1771051 -0.0000139 -0.1781528 -0.0755247 -0.0000119 -0.0000003 -0.0000059 0.0646916 0.1767094 0.2929878 0.0000441 0.4818649 0.1528321 0.0000309 0.000031 0.000035 -0.1302641 -0.0176439 -0.114417 -0.0000047 -0.1247719 -0.0048613 -0.0000043 -0.000008 -0.0000047 0.0445605 0.2512363 0.1372319 0.0000121 -0.007729 0.0053631 -0.0000035 -0.0000441 -0.0000382 0.0732393 -0.1083059 0.073848 0.0000081 0.0461855 0.0810062 0.0000086 -0.0000023 0.0000088 -0.1833923 0.0424052 -0.0197748 -0.0000002 0.0679292 0.1180681 0.0000072 0.0000046 0.0000162 -0.1475274 -0.0629567 0.0793957 0.0000064 0.0275546 0.0170949 0.000007 0.0000036 0.0000111 -0.1617456 0.0333914 0.0747814 0.0000061 0.1236911 0.0715533 0.0000106 0.0000052 0.0000103 -0.1684375 0.752825 -0.1533165 -0.0000563 -0.3358135 0.7898822 0.0000621 0.0001137 0.000075 -0.0701506 -0.0761326 -0.0740648 -0.0000036 -0.0523385 0.1173302 0.000011 -0.0000004 0.0000101 -0.1560559 0.0765345 0.049504 0.0000064 0.0529268 -0.0576902 0.0000061 0.0000073 0.0000048 -0.1639319 -0.2306166 -0.0570959 0.0000093 -0.0599548 -0.0211183 -0.0000128 -0.0002132 -0.0000567 0.0701479 0.0140236 -0.1205648 -0.0000065 -0.0558108 -0.0502712 -0.0000074 -0.0000047 -0.0000081 0.1579277 0.0511956 0.0855352 0.0000006 0.0391834 -0.0239844 -0.0000049 0.0000067 -0.0000064 0.1652073 0.0370976 -0.1130063 -0.0000085 -0.0555238 -0.0160567 -0.0000075 -0.0000055 -0.0000117 0.156465 0.0247844 -0.0468567 -0.0000046 -0.1196057 -0.0683637 -0.0000105 -0.0000046 -0.0000094 0.1554878 0.0203777 0.0870844 0.0000006 0.109419 -0.0713716 -0.0000076 0.0000027 -0.0000089 0.1598581 -0.1476304 0.0036306 -0.0000055 0.0056259 0.0927918 -0.0000022 -0.0000059 -0.0000028 0.1631531 0.0209704 -0.0110355 0.0003395 -0.0460579 0.0500705 0.1026877 0.0679367 0.0965094 -0.0207166 -0.0055777 0.0387224 0.0000387 0.1206817 -0.0113674 -0.000083 0.0000828 -0.0000539 0.134251 0.0208579 -0.0110939 -0.0003912 -0.0460617 0.0502294 -0.1026048 -0.0679507 -0.0964408 -0.0208713 unknown
polarizability: 245.9148288|0.2395264|163.6027136|0.002432|0.0042651|61.4905975 unknown
InChI: InChI=1S/C12H9NS/c1-8-13-11-7-6-9-4-2-3-5-10(9)12(11)14-8/h2-7H,1H3
charge 0 multiplicity 1
23 atoms
S  -1.758796 -1.728601 -0.00027
N  -2.669337 0.804135 -0.000143
C  0.852128 -0.439805 -0.000109
C  -0.574997 -0.358691 -0.000138
C  1.580741 0.816698 -0.000052
C  -1.261477 0.882878 -0.000118
C  0.864458 2.066534 -0.000031
C  -0.526091 2.108939 -0.000064
C  1.58347 -1.671046 -0.000151
C  3.012567 0.779001 -0.000032
C  -3.108527 -0.434366 -0.000099
C  2.980873 -1.670461 -0.000124
C  3.702701 -0.43619 -0.000064
C  -4.54334 -0.865619 -0.000087
H  1.442008 2.997841 0.000006
H  -1.078657 3.052587 -0.000044
H  1.032119 -2.618607 -0.000206
H  3.563449 1.727043 0.00001
H  3.529446 -2.618449 -0.000154
H  4.797861 -0.449062 -0.000045
H  -4.781522 -1.474517 0.890945
H  -5.184343 0.030094 0.000366
H  -4.781735 -1.473737 -0.891598
