program: Gaussian 09
title: 000089591
version: EM64L-G09RevD.01
frameworkgroup: C1[X(C16H15NO3)]
method: RPBEPBE
basis: SDD
operation: Freq
keyword: #p
keyword: freq=noraman
keyword: PBEPBE/SDD
title: #p freq=noraman PBEPBE/SDD
converged: YES YES NO NO
title: Mulliken charges:
elementType: O O O N C C C C C C C C C C C C C C C C H H H H H H H H H H H H H H H
charge: -0.210328 -0.291555 -0.304527 -0.434646 0.301028 -0.484644 0.064477 0.080113 0.299960 -0.344461 -0.310058 -0.229638 -0.263030 -0.331604 -0.342606 0.198261 -0.247618 -0.229475 -0.222380 -0.499844 0.244034 0.244328 0.417499 0.236967 0.269786 0.222218 0.229054 0.241207 0.280367 0.233138 0.236635 0.236323 0.241342 0.241126 0.228551
chargesum: 0.00000
title: Mulliken charges with hydrogens summed into heavy atoms:
elementType: O O O N C C C C C C C C C C C C C C C C
charge: -0.210328 -0.291555 -0.304527 -0.017148 0.301028 0.003718 0.064477 0.080113 0.299960 -0.107494 -0.040272 -0.007419 -0.033977 -0.090397 -0.062239 0.198261 -0.014480 0.007161 0.013943 0.211175
polarizability: 2.97549370e+02 -2.97959204e+00 2.24804590e+02 -4.31102124e-02 -2.63482390e-02 8.19397184e+01
1716.lowfreq: -4.6939 -0.0007 -0.0002 0.0006 3.7940 6.2458 25.6790 31.2552 47.2866
frequency: 25.6789 31.2542 47.2748 62.1708 76.1545 92.6843 118.9487 122.9177 144.0823 169.1963 192.9882 198.3224 200.7007 270.8158 284.8871 332.1724 365.6638 398.7275 407.8323 420.0576 439.0297 468.7670 526.1821 543.2061 583.5141 584.1881 612.9514 642.2394 665.8860 677.8230 694.2507 754.6514 755.5687 761.6928 770.8997 788.3063 827.8572 848.6324 855.7678 867.5198 924.3849 935.3154 960.5879 982.3095 982.5421 989.6595 990.1551 994.0673 1013.4845 1027.7207 1043.9533 1049.4154 1087.4622 1114.2093 1117.4382 1146.7889 1163.0511 1174.5824 1175.4175 1192.2266 1221.8882 1232.3607 1236.7897 1273.2742 1314.6692 1322.4798 1347.8173 1387.9281 1390.2564 1423.0397 1428.9350 1437.5263 1449.1346 1450.1358 1464.1543 1465.1552 1484.4145 1518.1549 1571.2982 1578.6313 1584.5304 1603.2392 1615.3371 1634.2263 2914.1187 2947.9281 3002.0617 3102.4731 3127.0966 3130.7379 3139.3426 3143.6412 3150.0329 3152.2554 3159.8919 3162.4892 3170.8680 3179.4653 3323.5380
redmass: 5.6881 3.9807 5.3334 4.8959 3.3488 1.3795 5.1724 3.2836 4.6119 4.3795 4.4396 2.8557 6.3668 4.4268 6.8022 4.4688 7.4481 2.7911 8.2854 3.3102 3.5179 6.6395 3.1331 5.3558 6.2517 2.5660 6.4398 6.4989 6.5649 4.3790 1.7882 5.9583 2.4232 1.6387 1.7056 5.7954 1.1688 1.5410 1.2545 4.6727 7.8457 1.3868 1.3680 5.0786 1.3452 1.4374 6.2667 1.8282 1.3987 2.0587 3.3700 3.0367 1.5916 1.2601 2.5453 1.4769 2.2883 1.0744 1.0782 1.1460 1.0756 1.8067 2.8754 2.1076 1.6134 1.4319 1.9803 7.1458 4.4492 1.7187 1.5282 2.2244 2.6278 1.0506 1.2461 1.0537 1.9217 3.4498 6.5058 7.3101 3.8491 6.1888 6.8264 6.8346 1.0576 1.0988 1.0295 1.1043 1.0863 1.0851 1.0881 1.1047 1.0924 1.0893 1.0962 1.0945 1.1014 1.0979 1.0792
irintensity: 1.6022 0.0112 0.9082 0.0230 2.8525 1.9601 0.1139 0.5414 3.5652 5.3351 0.1040 3.4073 0.5290 1.9878 36.9297 27.5030 0.8293 0.0446 5.9800 1.7271 0.0007 6.6907 13.8752 16.0292 3.2286 5.5620 0.4082 8.2678 7.4119 15.9100 52.1306 6.0854 34.2885 108.2355 14.3380 5.3112 90.5367 0.0526 0.6998 1.7972 3.5181 2.6078 1.3730 91.6953 0.2179 0.3800 13.4721 0.2742 0.3740 1.3184 70.5945 122.7201 13.4608 0.1110 68.4126 94.3585 19.0601 7.7534 0.4771 16.4054 1.8326 92.5167 433.0166 172.8654 12.6562 8.6360 63.1239 9.0055 2.7869 34.4717 2.9822 20.3650 10.5329 13.2636 58.4501 18.7588 9.2192 322.8812 259.3190 55.9598 96.5743 23.5290 40.0252 272.7285 128.1314 21.1666 47.8730 28.4155 9.0753 0.9725 5.4213 19.8879 19.9704 20.5553 16.8780 21.7715 22.7078 12.3155 122.2307
temp: 298.150 k
press: 1.00000 atm
elementType: 8 8 8 7 6 6 6 6 6 6 6 6 6 6 6 6 6 6 6 6 1 1 1 1 1 1 1 1 1 1 1 1 1 1 1
symmnumber: 1
zpe: 717385.9 jmol-1
zpe.correction: 0.273238 hartree
zpe.thermalcorrener: 0.291312 hartree
zpe.thermalcorrenthalpy: 0.292256 hartree
zpe.thermalcorrgfe: 0.225045 hartree
zpe.sumelectzpe: -897.714984 hartree
zpe.sumelectthermal: -897.696909 hartree
zpe.sumelectthermalent: -897.695965 hartree
zpe.sumelectthermalfe: -897.763177 hartree
dipole: -2.9030 2.6015 -0.0032
dipole: 3.8981
quadrupole: -85.2392 -106.7838 -121.7971
quadrupole: -8.9752 -0.0079 0.0161
quadrupole: 19.3675 -2.1771 -17.1904 -8.9752 -0.0079 0.0161
hfenergy: -897.9882215 hartree
pointgroup: C01 [X(C16H15N1O3)]
dipole: -1.1057116 -1.0623546 -0.0291968 debye
polarizability: 297.2290713|5.4659974|225.0540358|2.3784687|2.585314|82.0105713 unknown
InChI: InChI=1S/C16H15NO3/c1-20-16(19)13-9-5-6-10-14(13)17-11-15(18)12-7-3-2-4-8-12/h2-10,17H,11H2,1H3
charge 0 multiplicity 1
35 atoms
O  -1.457139 1.802761 0.064316
O  4.495741 1.668111 0.126736
O  2.213873 2.108926 0.104468
N  0.537034 0.000942 0.05069
C  1.669037 -0.788581 0.049435
C  -0.80723 -0.537744 0.028234
C  2.994812 -0.205117 0.074924
C  -1.8419 0.599038 0.038698
C  -3.295265 0.236737 0.017676
C  1.572004 -2.219068 0.023227
C  4.137603 -1.051941 0.073652
C  2.720334 -3.025539 0.022561
C  4.017843 -2.450473 0.047879
C  -3.748966 -1.110468 -0.011145
C  -4.250171 1.289971 0.027389
C  3.1558 1.258597 0.10208
C  -5.130165 -1.396031 -0.029575
C  -5.62897 1.003584 0.008974
C  -6.072811 -0.340877 -0.019492
C  4.706102 3.132044 0.154878
H  -0.988414 -1.163368 -0.8751
H  -1.004558 -1.195671 0.904587
H  0.654997 1.029252 0.068103
H  0.587148 -2.694788 0.002532
H  5.122346 -0.577121 0.093294
H  2.606832 -4.115901 0.001812
H  4.9088 -3.085645 0.047836
H  -3.034782 -1.940799 -0.019492
H  -3.881403 2.320879 0.049595
H  -5.47314 -2.435993 -0.051672
H  -6.357919 1.820977 0.016693
H  -7.145275 -0.564771 -0.033777
H  4.237322 3.571323 1.051638
H  4.269383 3.60115 -0.742976
H  5.798196 3.256605 0.176323
