program: Gaussian 09
title: 000089560
version: EM64L-G09RevD.01
frameworkgroup: C1[X(C9H18O)]
method: RPBEPBE
basis: SDD
operation: Freq
keyword: #pfreq=noraman
keyword: PBEPBE/SDD
title: #p freq=noraman PBEPBE/SDD
converged: NO YES NO NO
title: Mulliken charges:
elementType: O C C C C C C C C C H H H H H H H H H H H H H H H H H H
charge: -0.450765 -0.359607 -0.381190 -0.354600 -0.437645 -0.355472 -0.131843 -0.695387 -0.027475 -0.589441 0.185545 0.192276 0.220633 0.185944 0.187802 0.190378 0.185321 0.217428 0.194293 0.195807 0.187509 0.215690 0.210406 0.209649 0.243302 0.328332 0.216995 0.216116
chargesum: 0.00000
title: Mulliken charges with hydrogens summed into heavy atoms:
elementType: O C C C C C C C C C
charge: -0.122433 0.018214 0.025388 0.023580 -0.034896 0.034629 0.055666 -0.059643 0.215826 -0.156331
polarizability: 1.12705383e+02 1.52967225e+00 1.07014538e+02 1.82919920e+00 -2.98285665e+00 8.28737787e+01
1716.lowfreq: -11.3905 -0.0006 -0.0005 -0.0002 7.8309 15.8763 42.9706 44.3793 64.1968
frequency: 42.4877 44.2812 64.1461 90.1524 102.3829 117.7761 147.5753 187.5557 230.1679 232.0430 278.8297 303.9597 328.3499 349.2794 432.1148 457.2300 536.7151 681.1818 722.5518 737.0363 782.1906 846.1581 889.6431 897.1300 949.7134 955.3725 977.8250 1001.9729 1007.0154 1029.1801 1035.5502 1059.6101 1073.5915 1080.7444 1115.7365 1148.2530 1192.2306 1218.3474 1235.6045 1242.4783 1271.6365 1273.4142 1281.7078 1287.0680 1296.6005 1309.1124 1331.0787 1351.2046 1356.2165 1365.2374 1389.5291 1437.2193 1458.6561 1464.1532 1465.8170 1474.5157 1477.1967 1482.9685 1488.9782 1665.0151 2946.4422 2948.5036 2952.0147 2955.4910 2963.4721 2968.7234 2972.5832 2987.9107 3002.7377 3014.7977 3028.9808 3044.4037 3069.0392 3071.2079 3088.3647 3107.4683 3197.8054 3543.7172
redmass: 3.4416 1.7089 3.1967 2.8716 2.3046 1.8239 2.0716 3.3072 1.2316 2.4782 1.1405 2.9861 2.1614 2.4213 3.0866 3.1374 3.4496 1.7288 1.0669 1.1265 1.2636 1.5482 1.8574 1.4374 1.4466 2.5780 1.4422 2.3349 1.2710 2.7726 1.7712 1.9038 2.3938 2.1955 2.2508 1.8004 1.6369 1.3123 1.2814 1.3081 1.2496 1.2499 1.1421 1.0856 1.0986 1.2288 1.3994 1.5263 1.6570 1.4371 1.2175 1.2450 1.0974 1.0675 1.0769 1.0726 1.0425 1.0801 1.0916 4.8474 1.0786 1.0680 1.0597 1.0595 1.0624 1.0599 1.0364 1.0961 1.0979 1.0974 1.1033 1.1034 1.1006 1.0993 1.0602 1.0940 1.1143 1.0658
irintensity: 0.7125 0.0523 0.3411 0.0817 0.6470 0.0834 0.2574 1.1900 1.1444 8.0365 130.3132 9.0961 6.0126 12.3307 5.4702 3.1242 5.5019 7.2827 12.8759 0.0340 2.6254 2.7891 3.4101 1.0028 138.8461 32.4736 14.2070 4.1098 23.8887 10.0312 3.1005 1.1769 2.8532 0.3360 24.9610 32.3885 5.0025 21.9449 9.6148 1.5381 0.3722 1.1348 0.5341 1.0831 0.9697 4.3611 4.6986 5.1112 0.6499 10.5363 10.9621 18.9209 0.1526 0.0782 0.2370 1.2352 12.4442 1.5449 21.8906 4.1117 43.4038 22.0355 7.4167 5.1105 11.5888 136.5552 35.7683 3.5519 4.0949 11.0916 6.4319 127.2734 95.0184 54.0366 12.7155 7.0279 26.9297 5.9207
temp: 298.150 k
press: 1.00000 atm
elementType: 8 6 6 6 6 6 6 6 6 6 1 1 1 1 1 1 1 1 1 1 1 1 1 1 1 1 1 1
symmnumber: 1
zpe: 655644.2 jmol-1
zpe.correction: 0.249722 hartree
zpe.thermalcorrener: 0.263045 hartree
zpe.thermalcorrenthalpy: 0.263989 hartree
zpe.thermalcorrgfe: 0.208886 hartree
zpe.sumelectzpe: -428.109798 hartree
zpe.sumelectthermal: -428.096475 hartree
zpe.sumelectthermalent: -428.095531 hartree
zpe.sumelectthermalfe: -428.150634 hartree
dipole: -2.0904 -0.4434 -0.6660
dipole: 2.2382
quadrupole: -79.7447 -59.7901 -62.0485
quadrupole: 0.8266 -1.6361 2.2216
quadrupole: -12.5503 7.4043 5.1460 0.8266 -1.6361 2.2216
hfenergy: -428.3595197 hartree
pointgroup: C01 [X(C9H18O1)]
dipole: 0.8250223 0.1556738 -0.2656045 debye
polarizability: 112.7508812|1.3983136|107.1103149|-1.8039682|2.3851027|82.7325039 unknown
InChI: InChI=1S/C9H18O/c1-3-5-6-7-8-9(10)4-2/h4,9-10H,2-3,5-8H2,1H3
charge 0 multiplicity 1
28 atoms
O  -3.613497 1.392256 -0.12824
C  1.388714 0.644139 0.168831
C  0.028758 0.05556 -0.269292
C  2.588031 -0.258443 -0.198101
C  -1.166181 0.966477 0.088291
C  3.948895 0.320987 0.250967
C  -2.539112 0.391883 -0.348486
C  5.142714 -0.584545 -0.121386
C  -2.947079 -0.815304 0.464209
C  -2.98909 -2.087069 -0.00058
H  1.527286 1.64308 -0.296271
H  1.378591 0.811952 1.266154
H  -0.114175 -0.936792 0.202172
H  0.043519 -0.120205 -1.365863
H  2.604593 -0.420139 -1.296413
H  2.44795 -1.259682 0.260446
H  -1.024757 1.953556 -0.405087
H  -1.189311 1.156547 1.179811
H  4.086813 1.322636 -0.205604
H  3.932147 0.480256 1.348582
H  -2.488828 0.122133 -1.426481
H  6.102814 -0.146389 0.208168
H  5.046652 -1.580992 0.349883
H  5.198585 -0.736413 -1.215955
H  -3.208368 -0.589613 1.50839
H  -3.32238 2.25442 -0.523022
H  -3.268824 -2.925667 0.646649
H  -2.749261 -2.327328 -1.043973
