program: Gaussian 09
title: 000089540
version: EM64L-G09RevD.01
frameworkgroup: C1[X(C7H15NO2)]
method: RPBEPBE
basis: SDD
operation: Freq
keyword: #p
keyword: freq=noraman
keyword: PBEPBE/SDD
title: #p freq=noraman PBEPBE/SDD
converged: YES YES NO NO
title: Mulliken charges:
elementType: O O N C C C C C C C H H H H H H H H H H H H H H H
charge: -0.283758 -0.449072 -0.123693 -0.385442 -0.013269 -0.401052 -0.249906 -0.047359 -0.696862 -0.675523 0.236665 0.187565 0.218503 0.173428 0.235164 0.223410 0.184617 0.196072 0.205832 0.238688 0.220701 0.228743 0.219519 0.227404 0.329622
chargesum: 0.00000
title: Mulliken charges with hydrogens summed into heavy atoms:
elementType: O O N C C C C C C C
charge: -0.283758 -0.119449 -0.123693 0.038788 0.205234 0.007541 0.158122 0.148713 -0.031641 0.000143
polarizability: 1.08218535e+02 2.51601867e+00 7.90930137e+01 -3.50222605e+00 1.08901972e-01 7.95281029e+01
1716.lowfreq: -22.9286 -12.4011 -6.1832 -0.0005 0.0003 0.0008 26.0283 56.2843 68.1018
frequency: 24.2220 56.2424 67.8975 98.9273 161.6492 201.7879 209.0429 261.8304 298.6541 310.5434 337.2669 358.8650 416.5154 450.5249 461.3397 590.6126 652.6731 776.9778 836.7447 858.1633 892.5710 908.2011 928.5618 941.2445 988.8888 1042.5088 1061.2022 1065.6601 1078.2083 1096.4660 1122.4478 1137.2729 1140.2722 1161.7181 1188.1989 1207.5635 1232.4834 1257.6191 1286.2496 1296.6638 1319.8945 1356.2922 1359.8077 1373.4541 1377.2854 1390.5345 1400.6073 1453.2899 1460.4265 1460.4526 1471.4849 1477.9902 1478.9172 1501.5121 2798.8578 2844.1329 2872.2243 2937.7446 2983.7746 2989.9262 2995.0162 3006.7204 3041.7231 3052.3125 3086.6183 3095.7373 3100.2789 3106.2527 3540.6752
redmass: 3.3936 3.1946 2.6520 3.5451 2.6450 1.0866 1.0921 2.6268 2.7500 1.3934 2.5385 2.1623 2.8047 2.2598 2.3698 3.7190 5.9530 3.6086 2.7222 4.1804 1.9376 1.6228 1.7675 1.5105 3.1468 2.2245 2.2375 1.8994 1.6453 1.7064 1.5953 1.7679 1.4013 2.4065 2.4229 1.8447 1.2521 1.2959 1.2604 1.1647 1.2777 1.4993 1.2860 1.2561 1.5899 1.2707 1.4932 1.0835 1.0566 1.0541 1.0788 1.0510 1.0566 1.0907 1.0707 1.0707 1.0704 1.0842 1.0838 1.0374 1.0355 1.0912 1.0878 1.0917 1.0986 1.0995 1.1004 1.1006 1.0658
irintensity: 9.0647 1.5065 0.6557 1.5706 0.7901 1.2751 1.9544 6.9447 16.9805 73.2064 69.6379 13.3820 9.1490 7.0831 3.3896 0.5379 8.8223 13.4067 5.3898 17.7300 1.6925 13.5202 15.2096 21.4023 45.7627 49.1088 22.6796 52.0859 13.9902 19.7706 12.3975 29.4905 10.9899 46.4485 22.8899 17.7271 44.1613 12.2314 4.5492 13.2369 1.3808 8.1508 13.4353 9.6959 2.3911 29.4383 34.6246 1.0924 11.8889 4.5724 6.6142 8.0655 11.5394 3.6085 102.4652 130.2143 110.8198 54.3165 44.0006 24.4987 16.3936 64.3474 21.6414 27.8383 32.7511 33.8953 34.0266 21.6095 4.9674
temp: 298.150 k
press: 1.00000 atm
elementType: 8 8 7 6 6 6 6 6 6 6 1 1 1 1 1 1 1 1 1 1 1 1 1 1 1
symmnumber: 1
zpe: 567020.5 jmol-1
zpe.correction: 0.215967 hartree
zpe.thermalcorrener: 0.227777 hartree
zpe.thermalcorrenthalpy: 0.228722 hartree
zpe.thermalcorrgfe: 0.177220 hartree
zpe.sumelectzpe: -480.067608 hartree
zpe.sumelectthermal: -480.055798 hartree
zpe.sumelectthermalent: -480.054853 hartree
zpe.sumelectthermalfe: -480.106355 hartree
dipole: -1.0825 -1.4892 -0.8630
dipole: 2.0333
quadrupole: -72.3492 -62.7764 -58.4773
quadrupole: 6.8547 -5.0998 0.4704
quadrupole: -7.8149 1.7579 6.0570 6.8547 -5.0998 0.4704
hfenergy: -480.283575 hartree
pointgroup: C01 [X(C7H15N1O2)]
dipole: -0.4181565 -0.6111855 -0.3025255 debye
dipolederiv: -0.8649218 -0.1341531 0.1763023 -0.1584232 -0.5388273 0.1272077 0.2033855 0.113531 -0.4567853 -0.8096158 0.0342738 0.2834315 0.0324332 -0.57648 -0.0350018 0.2895815 -0.0345708 -0.3005804 -0.8336764 -0.0145668 0.0550325 0.0871234 -0.5009168 -0.0333973 0.0056693 0.0157013 -0.5224561 0.1895077 0.2659616 0.0121984 0.2717484 0.2143373 0.0541581 0.0032321 0.0834065 0.3079764 0.4796482 0.101502 -0.0768999 0.2442068 0.4170369 -0.1216446 -0.1963367 -0.0951781 0.4697339 0.3980331 -0.1356908 -0.0579514 -0.2489462 0.1172477 0.0962235 -0.1162939 0.0836924 0.4029457 0.7194107 0.0998545 -0.1348309 -0.1252551 0.5512746 -0.0234603 -0.0144771 -0.0715121 0.6124204 0.5941293 -0.0757689 -0.1251921 -0.0732009 0.4399109 0.0636431 -0.1308522 0.0531161 0.4081903 -0.1401616 -0.072698 -0.0254637 -0.0334843 0.0298307 -0.0134256 -0.0517226 -0.0235484 0.0543141 -0.0258286 -0.013035 -0.0421455 0.0012272 0.039411 -0.0598332 0.0155114 -0.0656194 -0.1539988 0.0808201 0.020205 -0.0245184 -0.028392 -0.0398233 0.0948943 -0.0094808 0.1161106 -0.0475944 -0.0453849 -0.0549853 -0.0011204 -0.1151537 -0.0800392 -0.0783841 -0.0890463 -0.1913549 -0.1394491 0.0079982 -0.0208432 -0.0118513 -0.0217505 -0.0178261 -0.0519064 0.0572763 -0.0257481 -0.2043511 -0.0872126 -0.0061047 -0.0465793 0.0201859 0.0043658 -0.0665539 0.117294 -0.1514291 -0.2828019 0.0329112 0.0297017 -0.0034641 0.0507721 -0.0666234 0.0662813 -0.0039183 0.1066611 0.0121974 -0.0569824 -0.1320196 0.0148939 -0.1149175 -0.1310392 -0.0185532 -0.0384225 -0.0533203 0.0277894 -0.0576951 -0.0080719 0.0914299 0.0383479 0.0025958 -0.0817346 0.0735699 0.069159 -0.2811585 -0.0297468 0.0742129 -0.0088841 0.0780656 -0.1631292 0.0755384 -0.0514306 0.1029194 -0.0688133 0.0520883 -0.0489038 0.0216231 -0.1006539 -0.0469837 0.1107964 0.0469507 0.1187862 0.0049131 -0.0489487 0.0900168 0.0075909 0.1467674 -0.0169219 -0.016728 -0.0092775 -0.0245201 0.1030583 0.0740399 0.0109226 0.0488503 -0.0100388 0.0692628 -0.0728695 -0.0253767 -0.0853375 -0.1163232 0.0056134 0.0913967 0.1033991 0.0860075 0.0646829 -0.032482 0.0948095 -0.0216997 0.0586225 0.0935791 0.023631 -0.0389443 0.0638211 -0.0829478 0.112666 -0.0318365 0.0605866 0.0354092 -0.062103 -0.1341386 -0.0526778 -0.1408844 -0.0081946 -0.0227754 -0.0255216 -0.0079164 0.0763827 0.3344985 0.0093013 -0.1642288 0.0503943 0.3197959 -0.072659 -0.1132867 -0.071915 0.0003588 unknown
polarizability: 108.2002218|2.5860504|79.1599828|-3.5297389|0.1097197|79.4794468 unknown
InChI: InChI=1S/C7H15NO2/c1-6(9)3-8-4-7(2)10-5-8/h6-7,9H,3-5H2,1-2H3
charge 0 multiplicity 1
25 atoms
O  -1.992342 1.121904 -0.442776
O  3.610362 -0.449129 -0.705867
N  -0.061567 -0.101703 0.160055
C  -1.226196 -1.018187 0.266859
C  -2.395038 -0.028741 0.427995
C  1.189169 -0.718629 -0.31376
C  -0.541237 1.047736 -0.653618
C  2.412986 0.215946 -0.148148
C  -3.76572 -0.523836 -0.029136
C  2.734916 0.519508 1.314431
H  -1.110963 -1.687987 1.136356
H  -1.373608 -1.638397 -0.652465
H  -2.434449 0.335294 1.474606
H  1.113338 -1.023473 -1.394789
H  1.380353 -1.63494 0.274377
H  -0.070335 1.992792 -0.324237
H  -0.354662 0.898296 -1.748032
H  2.227885 1.1653 -0.69912
H  -4.110195 -1.358713 0.60906
H  -4.506792 0.29081 0.039179
H  -3.725747 -0.867897 -1.077415
H  1.846271 0.9412 1.814524
H  3.024426 -0.411784 1.833263
H  3.573778 1.232016 1.387461
H  3.450966 -0.652587 -1.663703
