program: Gaussian 09
title: 000089554
version: EM64L-G09RevD.01
frameworkgroup: C1[X(C7H10O4)]
method: RPBEPBE
basis: SDD
operation: Freq
keyword: #pfreq=noraman
keyword: PBEPBE/SDD
title: #p freq=noraman PBEPBE/SDD
converged: YES YES NO NO
title: Mulliken charges:
elementType: O O O O C C C C C C C H H H H H H H H H H
charge: -0.414348 -0.418109 -0.231137 -0.226155 -0.215033 -0.179797 -0.449175 -0.468360 -0.434173 0.159343 0.125403 0.287901 0.300443 0.251753 0.224490 0.246736 0.229561 0.229837 0.222366 0.379121 0.379331
chargesum: 0.00000
title: Mulliken charges with hydrogens summed into heavy atoms:
elementType: O O O O C C C C C C C
charge: -0.035226 -0.038778 -0.231137 -0.226155 0.072868 0.120646 0.027068 0.007937 0.018030 0.159343 0.125403
polarizability: 9.45389939e+01 3.95318213e+00 8.35537715e+01 -7.25728534e-02 9.40759469e-01 7.16814258e+01
1716.lowfreq: -30.5951 -3.8024 -0.0007 0.0007 0.0009 9.3718 19.7189 24.6876 44.6205
frequency: -10.2597 24.6285 44.5755 136.2460 175.9378 199.6147 288.7003 312.2592 366.7223 419.2797 530.3861 544.3678 565.7206 597.7921 611.0103 639.6942 685.6544 725.8207 801.8522 845.2773 865.6877 908.1329 919.8386 942.0441 959.2446 1038.3984 1051.5363 1052.8971 1088.9619 1100.7110 1136.0280 1161.2800 1202.6556 1233.4148 1239.6950 1254.7934 1263.6934 1293.2266 1303.7900 1314.0655 1337.7675 1364.3273 1470.3869 1477.3931 1488.0440 1654.4184 1659.7500 3001.1741 3001.9127 3007.9741 3016.7766 3056.9636 3068.4953 3081.0731 3089.8663 3512.4405 3514.9491
redmass: 3.6303 10.4828 10.9538 3.8291 4.2732 3.4424 2.3262 4.3768 6.2797 4.5825 2.5460 2.5509 2.7800 1.9512 1.6309 1.8600 3.2002 3.8680 2.3041 3.4118 2.0709 2.3273 2.2108 2.1946 3.0045 2.0286 2.3000 1.9589 2.0113 1.9548 1.6637 1.5301 1.2746 1.2817 1.3803 1.5632 1.4222 1.3316 1.5375 1.3932 1.7230 1.8613 1.0853 1.0832 1.0955 8.6415 8.7997 1.0821 1.0635 1.0629 1.0626 1.0851 1.0989 1.1025 1.1045 1.0640 1.0640
irintensity: 0.3290 1.1829 1.0805 0.3464 3.6277 0.0961 1.6915 2.1802 3.9015 19.9223 20.5146 14.2657 30.9367 132.1533 84.6502 30.4897 54.1198 18.7407 6.6854 19.2382 6.6278 11.0419 3.4471 39.5181 4.2023 177.7104 145.3522 133.5868 35.0333 49.9422 11.2726 7.7968 2.9713 17.0634 4.5756 6.4952 20.9711 10.9248 19.8812 5.7508 17.3269 24.1274 8.0001 12.1730 7.1302 220.1132 218.2250 11.0968 33.6827 24.3252 17.9056 9.2657 23.8260 21.1379 32.6031 25.3657 21.9835
temp: 298.150 k
press: 1.00000 atm
elementType: 8 8 8 8 6 6 6 6 6 6 6 1 1 1 1 1 1 1 1 1 1
symmnumber: 1
zpe: 434539.6 jmol-1
zpe.correction: 0.165507 hartree
zpe.thermalcorrener: 0.175355 hartree
zpe.thermalcorrenthalpy: 0.176299 hartree
zpe.thermalcorrgfe: 0.128684 hartree
zpe.sumelectzpe: -572.807275 hartree
zpe.sumelectthermal: -572.797428 hartree
zpe.sumelectthermalent: -572.796484 hartree
zpe.sumelectthermalfe: -572.844098 hartree
dipole: -1.4684 -0.1740 -1.3299
dipole: 1.9887
quadrupole: -65.1731 -59.2025 -67.9413
quadrupole: -4.0482 1.7017 1.9652
quadrupole: -1.0674 4.9031 -3.8357 -4.0482 1.7017 1.9652
hfenergy: -572.9727827 hartree
pointgroup: C01 [X(C7H10O4)]
dipole: 0.5572429 -0.1466373 0.5292952 debye
dipolederiv: -0.8294094 0.2798385 -0.4488141 0.2652152 -0.5650851 0.2513909 -0.3986327 0.2370903 -0.5769078 -0.308338 -0.0691496 -0.0482232 -0.0569312 -1.2593412 0.0199227 -0.0340278 0.0739256 -0.3855251 -0.606575 0.1915951 0.1669287 0.1552798 -0.3721707 -0.0655316 -0.0926676 0.0096887 -0.9405339 -0.9574809 0.2764123 0.0622125 0.0132282 -0.6927431 0.016765 0.1647629 -0.0398111 -0.3078174 0.0018081 0.1183105 0.0625413 0.1108087 -0.1337571 -0.0806623 0.2268475 -0.1070592 -0.0807849 -0.348429 -0.1216458 0.0249617 -0.0062247 -0.0179834 -0.0090044 0.1613528 0.0069847 0.055323 -0.0035608 0.0256137 -0.0334257 -0.0399888 0.1542308 0.0739609 -0.0358496 0.0288474 0.0927238 -0.0120534 -0.0436325 -0.0154573 0.0040314 0.068211 -0.021792 -0.055227 0.0148531 0.1126127 0.089899 0.0041254 -0.0402558 -0.0425695 0.0435631 0.0453008 -0.0697795 0.0119604 0.057307 1.1302915 -0.668862 0.0922967 -0.5781281 0.5100179 -0.0955857 0.1761406 -0.0805806 1.28504 1.3183793 -0.0667149 -0.1625112 0.0775113 1.4906086 -0.0553147 -0.3206913 -0.0875796 0.2016437 0.0680558 0.0031024 0.0305649 0.0054783 -0.0079573 0.0649738 0.0222606 0.0733778 0.0261242 0.1647945 -0.0260746 0.0300326 -0.0618763 0.0335547 -0.0432158 -0.0603242 -0.0467831 0.0256468 -0.1059686 -0.0105894 -0.1029711 -0.0102917 0.0717963 0.0191864 -0.0805023 0.0043068 0.0474974 0.0092261 0.0195488 0.1350517 0.0324747 -0.0014449 -0.0390882 0.0922478 -0.0267686 -0.0705578 -0.0101554 0.0713937 0.052682 0.0306815 0.0600103 -0.0241952 0.0827054 -0.0564775 0.0203512 0.0570718 0.0130437 -0.043289 0.0109822 0.0336609 0.0521757 -0.0720516 0.0922745 -0.12076 0.0675827 0.0042148 -0.0018977 -0.0230343 -0.176605 -0.0587158 -0.0211038 -0.0762463 0.0643757 -0.0771756 -0.0127212 0.0852019 0.0295792 0.0849534 -0.0143973 0.1045523 0.0216426 -0.0520725 0.2586775 0.0565156 0.0872498 0.0588469 0.3519652 -0.04042 0.1377379 -0.0750878 0.1886822 0.0933599 -0.0443246 0.0671214 0.0249271 0.3245154 0.0042469 0.0722497 0.0214419 0.3576316 unknown
polarizability: 93.767415|-4.8331913|84.3955356|0.1041279|-0.3683104|71.6112405 unknown
InChI: InChI=1S/C7H10O4/c8-6(9)4-2-1-3-5(4)7(10)11/h4-5,8,10H,1-3H2
charge 0 multiplicity 1
21 atoms
O  2.551612 -1.353226 0.656939
O  -1.938388 -1.840989 -0.013356
O  1.803777 -0.887979 -1.48724
O  -3.115405 0.152598 0.115221
C  0.44751 -0.194044 0.48211
C  -0.709685 0.170819 -0.51723
C  0.867195 1.174853 1.118913
C  -0.759081 1.725958 -0.596217
C  0.591048 2.201518 -0.003792
C  1.621516 -0.827747 -0.250626
C  -2.038408 -0.441166 -0.110374
H  0.129712 -0.910512 1.258151
H  -0.445067 -0.262567 -1.501687
H  1.909504 1.167002 1.479255
H  0.210296 1.376106 1.985703
H  -1.604249 2.09685 0.011488
H  -0.918789 2.076724 -1.629606
H  0.544586 3.238377 0.371963
H  1.389317 2.155775 -0.768756
H  3.31319 -1.749069 0.152098
H  -2.826391 -2.215479 0.23634
