program: Gaussian 09
title: 000089644
version: EM64L-G09RevD.01
frameworkgroup: C1[X(C16H16O8)]
method: RPBEPBE
basis: SDD
operation: Freq
keyword: #pfreq=noraman
keyword: PBEPBE/SDD
title: #p freq=noraman PBEPBE/SDD
converged: YES YES NO NO
title: Mulliken charges:
elementType: O O O O O O O O C C C C C C C C C C C C C C C C H H H H H H H H H H H H H H H H
charge: -0.459845 -0.437302 -0.475471 -0.425054 -0.180451 -0.290792 -0.386878 -0.244523 0.214387 -0.163257 -0.384077 -0.300947 0.197409 0.285776 -0.733900 -0.272541 -0.050294 0.366531 0.018293 0.184399 -0.555454 0.383426 -0.522018 -0.533091 0.255737 0.301967 0.318320 0.246458 0.230953 0.240344 0.352006 0.361969 0.381126 0.364097 0.313925 0.280924 0.394613 0.256107 0.233792 0.233334
chargesum: 0.00000
title: Mulliken charges with hydrogens summed into heavy atoms:
elementType: O O O O O O O O C C C C C C C C C C C C C C C C
charge: -0.107839 -0.075333 -0.094345 -0.060957 -0.180451 -0.290792 0.007735 -0.244523 0.214387 0.092480 -0.082110 0.017373 0.197409 0.285776 -0.016145 -0.272541 -0.050294 0.366531 0.018293 0.184399 -0.241528 0.383426 -0.241093 0.190141
polarizability: 3.28861917e+02 -1.26835307e+01 2.21250381e+02 -1.49549896e+01 -1.14319442e+00 1.24802260e+02
1716.lowfreq: -9.4511 -6.4823 -3.1330 -0.0009 -0.0007 -0.0007 29.1005 45.9490 64.5852
frequency: 29.0271 45.9455 64.5724 79.3782 93.7108 123.6208 129.6191 168.6184 187.1407 197.4740 201.3097 204.3541 207.3709 213.0524 231.5542 248.4579 256.5768 276.5232 288.2341 293.9045 310.8500 322.9797 342.7950 348.0897 369.5843 379.6334 405.9005 431.2601 448.7930 465.8090 484.5165 490.1406 518.5597 529.6828 567.4653 590.1847 594.8126 611.4077 612.9538 633.4549 646.7944 676.6301 696.5277 704.4840 729.9662 749.4499 800.9418 823.4488 853.2955 861.2161 890.7750 905.9289 923.7256 924.8335 937.4283 941.3935 959.0152 989.2451 1005.8146 1014.6974 1030.7212 1044.8428 1087.6978 1106.9612 1111.2541 1137.1350 1141.7684 1158.2070 1169.5784 1196.1976 1205.8900 1235.2609 1245.3141 1251.9141 1267.6114 1283.3979 1294.8144 1328.3322 1348.9668 1353.3386 1363.3020 1386.8357 1388.1901 1397.8349 1406.7223 1418.0579 1431.7509 1434.9380 1460.6971 1465.2167 1468.3734 1471.3755 1471.5554 1528.7785 1549.2334 1564.4391 1596.3985 1629.0740 2698.8205 2976.1923 3000.4745 3033.9192 3050.8913 3071.4854 3101.2727 3110.4933 3113.8075 3141.4963 3177.7342 3189.0536 3310.5965 3413.6866 3502.3394 3584.9414
redmass: 6.0934 6.1975 6.8464 5.7251 4.6511 5.6363 6.7042 6.0488 5.9882 4.5200 2.3131 1.7071 1.8474 2.3833 6.1707 2.7456 4.1085 4.5747 5.1650 4.7799 3.1900 1.0767 1.6938 3.1074 6.5750 7.6803 6.4456 5.9004 4.9437 6.8770 6.3264 6.0843 6.1458 7.3424 3.6105 3.5746 2.8852 3.9644 2.1449 4.2584 4.3166 1.1380 5.2375 3.8337 5.3841 7.6910 5.2633 6.2486 4.6175 1.6910 3.2658 3.4538 1.9505 4.2795 2.5307 5.9648 1.0711 4.5625 3.3595 4.3687 3.5222 2.3211 2.4261 1.9132 1.2604 1.7829 1.6119 2.2741 2.1246 1.4523 1.5104 1.7132 1.7128 1.2668 2.0252 1.7191 1.9533 5.2339 1.9257 1.6450 1.3679 1.2815 1.3845 3.3303 4.4286 1.2707 5.9058 1.3843 2.4398 1.0565 1.0585 1.0795 1.2010 7.8750 4.9535 3.7445 7.7532 5.3570 1.0726 1.0323 1.0355 1.0854 1.0863 1.1047 1.1003 1.1000 1.0868 1.1009 1.0924 1.0917 1.0672 1.0643 1.0649 1.0668
irintensity: 0.5040 1.9002 0.6638 7.0654 0.2461 2.4589 0.8446 4.3117 4.5183 1.2957 4.7268 2.1510 6.1594 2.0769 6.1142 0.6126 2.1869 1.3635 7.3266 5.8777 39.9258 128.0829 21.7874 21.2774 2.6428 14.7735 11.8786 8.9771 39.0029 2.4116 2.9907 5.7977 4.8957 6.2089 56.9110 20.5263 14.2525 20.0441 43.6089 5.9257 21.2338 174.4190 24.2937 19.9114 23.7995 8.2151 18.0138 12.9630 18.5264 39.0618 38.2761 15.9256 67.1858 14.2001 12.9273 23.7393 128.8588 41.3459 11.8811 88.0599 15.4203 15.7262 57.6719 37.9146 0.1007 54.4235 32.6179 11.4512 106.0224 82.7255 22.9683 36.8051 26.9702 32.1981 99.3275 5.4697 27.7382 530.8749 184.1192 93.2828 1.1983 40.8180 47.3384 59.9956 28.1751 75.3501 50.7502 34.8659 82.1607 7.8146 16.0340 10.5936 6.0483 171.6410 76.5428 110.9559 97.8345 175.5709 119.1230 53.1252 13.1732 11.2003 8.5330 33.3329 11.1331 10.5102 2.7233 17.7036 3.1137 1.8600 81.7986 34.0794 7.1349 30.6855
temp: 298.150 k
press: 1.00000 atm
elementType: 8 8 8 8 8 8 8 8 6 6 6 6 6 6 6 6 6 6 6 6 6 6 6 6 1 1 1 1 1 1 1 1 1 1 1 1 1 1 1 1
symmnumber: 1
zpe: 783219.7 jmol-1
zpe.correction: 0.298313 hartree
zpe.thermalcorrener: 0.320327 hartree
zpe.thermalcorrenthalpy: 0.321271 hartree
zpe.thermalcorrgfe: 0.248827 hartree
zpe.sumelectzpe: -1219.307833 hartree
zpe.sumelectthermal: -1219.285818 hartree
zpe.sumelectthermalent: -1219.284874 hartree
zpe.sumelectthermalfe: -1219.357318 hartree
dipole: 5.3314 -3.8984 -0.0229
dipole: 6.6047
quadrupole: -112.8655 -159.0536 -140.4593
quadrupole: 11.5150 -5.5699 -6.6475
quadrupole: 24.5940 -21.5942 -2.9998 11.5150 -5.5699 -6.6475
hfenergy: -1219.6061456 hartree
pointgroup: C01 [X(C16H16O8)]
dipole: -2.1085282 1.5186257 0.0052923 debye
polarizability: 328.2254748|-12.7057162|220.8059743|19.2625308|5.0198793|125.8831086 unknown
InChI: InChI=1S/C16H16O8/c1-16(23)14(21)10-9(13(20)15(16)22)12(19)8-6(11(10)18)3-5(24-2)4-7(8)17/h3-4,13-15,17,20-23H,1-2H3
charge 0 multiplicity 1
40 atoms
O  3.013503 0.845023 -1.82455
O  4.068088 -1.518068 -1.305114
O  2.823187 1.228629 1.902805
O  2.482792 -1.546388 2.009266
O  -0.193197 2.665765 0.419689
O  -0.154097 -2.827558 -0.028761
O  -2.681694 -2.883557 -0.28195
O  -5.061565 1.362279 -0.193256
C  3.466953 0.710133 -0.404179
C  3.637777 -0.825751 -0.093225
C  2.369829 1.351437 0.483182
C  2.377201 -1.49752 0.52846
C  1.051858 0.616827 0.299346
C  1.073419 -0.76548 0.258027
C  4.799821 1.453709 -0.333744
C  -0.212616 1.397398 0.275057
C  -0.186714 -1.532073 0.076358
C  -1.484791 0.629649 0.097336
C  -1.440921 -0.799871 -0.003482
C  -2.67315 -1.519333 -0.178795
C  -2.703962 1.311871 0.029421
C  -3.91784 0.5772 -0.141714
C  -3.909955 -0.828583 -0.246683
C  -6.35881 0.689762 -0.364139
H  4.446701 -0.95977 0.64749
H  2.248457 2.419008 0.227552
H  2.325055 -2.546254 0.205625
H  5.559684 0.918093 -0.928393
H  4.693093 2.473976 -0.73994
H  5.14382 1.513823 0.712093
H  2.047253 0.615405 -1.883438
H  3.806902 -0.932867 -2.072505
H  2.366231 1.919233 2.444921
H  2.64179 -0.60065 2.311248
H  -2.732368 2.401977 0.105927
H  -4.818862 -1.419484 -0.378211
H  -1.694661 -3.204731 -0.207639
H  -7.099239 1.501469 -0.372121
H  -6.560256 0.001849 0.47807
H  -6.393317 0.136624 -1.321234
