program: Gaussian 09
title: 000089585
version: EM64L-G09RevD.01
frameworkgroup: C1[X(C8H11O4PS3)]
method: RPBEPBE
basis: SDD
operation: Freq
keyword: #p
keyword: freq=noraman
keyword: PBEPBE/SDD
title: #p freq=noraman PBEPBE/SDD
converged: NO YES NO NO
title: Mulliken charges:
elementType: S S S P O O O O C C C C C C C C H H H H H H H H H H H
charge: 0.869551 -0.104306 -0.198977 0.608459 -0.459547 -0.440201 -0.500951 -0.471387 -0.087680 -0.226942 -0.226248 -0.196791 -0.196038 -0.212008 -0.481878 -0.473534 0.287623 0.290602 0.247075 0.247626 0.242835 0.232095 0.269784 0.245939 0.250633 0.249670 0.234595
chargesum: 0.00000
title: Mulliken charges with hydrogens summed into heavy atoms:
elementType: S S S P O O O O C C C C C C C C
charge: 0.869551 -0.104306 -0.198977 0.608459 -0.459547 -0.440201 -0.500951 -0.471387 -0.087680 0.060682 0.064355 0.050285 0.051589 0.030827 0.265940 0.261364
polarizability: 3.45629511e+02 -1.52015460e+01 1.69601601e+02 -1.94305944e+01 8.32672297e+00 1.56729401e+02
1716.lowfreq: -16.0953 -4.7366 -3.1585 -0.0005 0.0016 0.0018 17.0053 18.5197 29.7397
frequency: 14.2297 17.7447 29.6986 38.1871 49.5944 59.4161 89.9105 97.8714 112.0486 120.6292 129.2952 143.2209 150.5749 167.6000 171.1965 199.8052 229.7657 247.9938 263.9100 304.2209 331.2342 360.6396 368.9974 403.1906 413.0358 419.3791 488.1444 513.0811 599.0014 645.9936 651.7463 670.2220 685.5421 758.4038 803.8346 843.5752 929.9246 934.1353 948.8389 961.0119 971.8167 984.5095 1005.4030 1006.9477 1042.5376 1078.4760 1107.8442 1119.8927 1127.4848 1133.9710 1174.6952 1179.5940 1304.4270 1383.0839 1419.3748 1424.6876 1437.0770 1449.4955 1455.7899 1456.6132 1467.8304 1468.0292 1571.1149 1601.2960 2982.8901 2988.7903 3095.1702 3097.0179 3129.2311 3138.0458 3141.9567 3152.7660 3161.2330 3170.2544 3178.7690
redmass: 6.6074 5.0404 6.7102 5.8060 5.8660 4.5046 2.2332 2.0268 2.4036 4.5219 1.1476 5.7252 6.2749 5.7277 10.3266 12.4546 8.5056 9.2098 8.6231 7.9496 7.5406 7.9819 7.4689 2.8231 14.7152 8.0424 4.6591 13.5427 6.4890 10.8124 7.1385 11.3178 2.4665 1.3916 18.0577 1.2431 18.0687 1.3397 11.6954 11.1003 6.5261 1.3875 3.9555 1.4115 2.0459 1.5475 1.2414 1.2434 1.2888 1.2925 1.0551 1.1216 1.2955 8.2792 1.1211 1.1180 2.2661 2.0054 1.0492 1.0500 1.0505 1.0526 5.7820 6.9188 1.0302 1.0298 1.1048 1.1047 1.1036 1.1037 1.0861 1.0886 1.0929 1.0971 1.1017
irintensity: 2.7884 0.4127 3.3886 0.0212 1.0906 3.0980 1.8174 0.2334 2.0260 5.0074 0.4531 1.2559 3.3997 5.3266 1.4828 13.7500 9.2719 11.5265 8.0765 3.1806 0.3059 46.8621 26.7791 0.0139 102.2747 18.8526 131.0620 11.3021 0.0037 66.2950 4.3715 72.8859 25.9064 63.4030 70.5883 0.3770 29.4817 1.1032 231.6284 120.0728 7.6022 0.1014 0.4477 1.3294 23.7700 5.8930 0.3840 1.0176 0.7320 0.8072 0.0816 17.2649 3.4200 7.8193 2.7670 9.2195 15.2288 18.4570 17.1154 15.6983 15.4267 9.9959 8.2694 0.8118 42.4323 49.6164 6.9147 16.7856 9.5738 8.5959 1.0205 10.4888 0.7897 1.2333 29.8688
temp: 298.150 k
press: 1.00000 atm
elementType: 16 16 16 15 8 8 8 8 6 6 6 6 6 6 6 6 1 1 1 1 1 1 1 1 1 1 1
symmnumber: 1
zpe: 478356.5 jmol-1
zpe.correction: 0.182196 hartree
zpe.thermalcorrener: 0.202702 hartree
zpe.thermalcorrenthalpy: 0.203646 hartree
zpe.thermalcorrgfe: 0.128222 hartree
zpe.sumelectzpe: -2146.358962 hartree
zpe.sumelectthermal: -2146.338456 hartree
zpe.sumelectthermalent: -2146.337512 hartree
zpe.sumelectthermalfe: -2146.412937 hartree
dipole: -3.8466 -0.3600 -0.4549
dipole: 3.8901
quadrupole: -92.0015 -116.4101 -135.4039
quadrupole: 4.8946 17.2130 -4.2581
quadrupole: 22.6037 -1.8050 -20.7987 4.8946 17.2130 -4.2581
hfenergy: -2146.5411582 hartree
pointgroup: C01 [X(C8H11O4P1S3)]
dipole: -1.5248975 -0.0989933 -0.0855182 debye
polarizability: 341.0205044|-10.3896491|165.7520521|-36.238809|11.0978655|165.1879559 unknown
InChI: InChI=1S/C6H5O2S.C2H6O2PS2/c7-9(8)6-4-2-1-3-5-6;1-3-5(6,7)4-2/h1-5H;1-2H3
charge 0 multiplicity 1
27 atoms
S  -0.464023 -0.233103 0.902603
S  0.761661 -0.090292 -1.329073
S  4.146956 -0.72724 -2.261693
P  2.917849 -0.062036 -0.727818
O  3.065567 -0.870639 0.798746
O  3.083884 1.556583 -0.157197
O  -0.231813 -1.744837 1.472012
O  -0.196968 1.067639 1.841871
C  -2.22949 -0.122782 0.230567
C  -2.858154 -1.316539 -0.158021
C  -2.824517 1.147816 0.174848
C  -4.185885 -1.219651 -0.636161
C  -4.15257 1.217188 -0.306592
C  -4.825189 0.040343 -0.712651
C  3.050104 -2.353427 0.852378
C  4.411826 1.974635 0.363411
H  -2.343013 -2.278254 -0.072733
H  -2.28252 2.038297 0.508239
H  -4.714494 -2.12672 -0.946161
H  -4.655117 2.188014 -0.362751
H  -5.852536 0.10486 -1.086408
H  3.642403 -2.784981 0.024168
H  2.005381 -2.70631 0.829859
H  3.511068 -2.599895 1.82035
H  4.657893 1.411272 1.279204
H  4.286307 3.043289 0.589294
H  5.19269 1.833468 -0.406091
