program: Gaussian 09
title: 000089604
version: EM64L-G09RevD.01
frameworkgroup: C1[X(C11H22N2O4)]
method: RPBEPBE
basis: SDD
operation: Freq
keyword: #p
keyword: freq=noraman
keyword: PBEPBE/SDD
title: #p freq=noraman PBEPBE/SDD
converged: YES YES NO NO
title: Mulliken charges:
elementType: O O O O N N C C C C C C C C C C C H H H H H H H H H H H H H H H H H H H H H H
charge: -0.302885 -0.304481 -0.290007 -0.284420 -0.617668 -0.619432 0.353188 -0.001762 -0.422919 -0.438558 -0.428320 -0.404426 -0.814008 -0.723545 -0.727239 0.303480 0.304861 0.206389 0.213264 0.195170 0.223643 0.199126 0.280384 0.232174 0.273843 0.212493 0.242976 0.243018 0.224518 0.211843 0.220177 0.215748 0.211267 0.213659 0.243268 0.341159 0.339843 0.334831 0.339346
chargesum: 0.00000
title: Mulliken charges with hydrogens summed into heavy atoms:
elementType: O O O O N N C C C C C C C C C C C
charge: -0.302885 -0.304481 -0.290007 -0.284420 0.063335 0.054746 0.353188 0.204627 -0.014485 -0.015788 0.084237 0.081911 -0.103496 -0.075777 -0.059044 0.303480 0.304861
polarizability: 1.51375469e+02 -3.70900812e+00 1.66197360e+02 6.71434976e-01 -1.05667350e+00 1.19583477e+02
1716.lowfreq: -4.1172 -0.0008 -0.0005 0.0004 7.9371 12.1101 30.6992 40.4294 46.8582
frequency: 30.6213 40.3783 46.7915 56.8174 60.3445 66.7151 75.5486 99.1801 125.1146 170.0492 191.2232 196.5350 221.2411 250.3548 257.9084 269.9014 279.8015 301.3965 309.2478 340.2924 348.6468 372.0345 409.0633 437.4792 454.5569 488.8347 498.3508 502.7314 519.4170 523.5140 556.0431 588.1712 609.5492 632.6659 698.9954 700.4781 703.5896 766.6959 776.9056 802.1781 809.7043 838.4080 905.8180 910.6791 917.1242 965.9720 989.8791 999.8427 1006.3152 1014.6558 1027.3025 1051.6291 1057.0464 1058.9621 1069.7385 1126.2429 1137.7051 1173.2373 1182.8036 1199.6217 1256.7442 1268.9094 1278.7514 1294.4449 1298.6064 1308.4244 1316.7472 1324.9494 1347.6934 1362.2411 1368.2720 1374.4278 1390.5829 1393.1420 1400.2849 1459.8338 1461.2365 1465.2488 1476.3215 1480.8153 1484.3137 1488.9959 1495.5423 1498.4474 1501.2932 1586.7485 1588.2547 1684.9878 1689.2897 2952.2383 2974.0921 2976.1267 2978.3324 2989.9501 2993.1543 3014.5669 3023.6419 3030.8227 3036.3102 3064.1399 3068.5813 3074.2287 3077.7058 3083.5211 3087.4857 3098.5407 3113.9792 3557.6576 3559.2765 3716.1145 3717.9743
redmass: 5.8619 6.5157 4.2614 5.8943 3.7226 3.6149 2.7207 4.8717 2.0033 3.5407 3.1258 5.2256 1.6754 1.3602 3.8941 2.4682 2.4331 1.8503 1.3095 2.1970 2.2151 2.2375 2.9939 2.6259 2.5131 1.1886 1.1853 2.4948 1.0639 1.0790 3.2028 3.1739 4.6927 4.0399 3.5837 9.8228 4.5715 1.4535 1.8837 3.8649 3.0827 1.7590 1.8274 2.0259 1.9104 1.7788 1.6105 5.8029 1.5343 5.4741 1.8705 2.1814 1.9963 1.9762 1.5397 2.6529 2.0608 2.3006 2.3753 2.2914 1.2599 1.1994 1.2195 2.0327 1.4284 2.4653 1.3844 1.5163 1.4754 1.3375 1.4239 1.3846 1.2099 1.2331 1.2178 1.0842 1.0694 1.0739 1.0485 1.0625 1.0502 1.0639 1.0584 1.0628 1.0526 1.2057 1.2136 7.0220 7.2486 1.0808 1.0431 1.0401 1.0496 1.0613 1.0389 1.0599 1.0954 1.0971 1.0595 1.0980 1.0992 1.1004 1.1000 1.1006 1.1053 1.0999 1.1043 1.0447 1.0445 1.1057 1.1057
irintensity: 1.1225 5.2500 0.9455 6.1719 1.0824 6.9659 1.3618 0.6021 0.9124 1.8069 5.8944 10.9079 0.8715 1.4779 2.4693 6.3579 1.2436 1.4246 1.5575 5.4053 5.0614 7.0489 4.4755 5.6183 2.8156 274.0871 288.2536 13.3600 12.1299 59.8997 1.2018 8.4450 1.0233 11.4897 11.9970 28.6855 26.1746 10.7522 1.5896 25.7820 18.2314 2.8310 10.7894 1.9227 10.9773 26.2623 12.3564 237.5914 14.4206 162.7243 0.8442 3.9187 14.9065 12.4840 3.7535 1.1558 5.7366 1.3855 5.9550 3.9105 6.7517 25.1287 26.9360 307.0736 27.4166 306.2086 42.1683 13.7307 13.6599 12.7157 60.7670 51.9780 15.6704 32.7292 26.1001 4.8648 5.4938 27.2692 8.0824 18.6857 13.5037 14.5388 22.3227 2.7472 17.1123 112.9330 104.9967 185.9793 453.3372 8.1144 42.2213 20.4681 31.3378 38.0951 22.4175 26.4837 28.2809 18.4413 35.3675 49.1193 54.1380 42.5037 57.1103 18.1445 19.5639 17.5170 3.2564 70.0347 59.4705 51.5919 48.9518
temp: 298.150 k
press: 1.00000 atm
elementType: 8 8 8 8 7 7 6 6 6 6 6 6 6 6 6 6 6 1 1 1 1 1 1 1 1 1 1 1 1 1 1 1 1 1 1 1 1 1 1
symmnumber: 1
zpe: 871814.7 jmol-1
zpe.correction: 0.332057 hartree
zpe.thermalcorrener: 0.352267 hartree
zpe.thermalcorrenthalpy: 0.353211 hartree
zpe.thermalcorrgfe: 0.282557 hartree
zpe.sumelectzpe: -841.419122 hartree
zpe.sumelectthermal: -841.398912 hartree
zpe.sumelectthermalent: -841.397967 hartree
zpe.sumelectthermalfe: -841.468622 hartree
dipole: -2.5284 0.2132 -0.1979
dipole: 2.5451
quadrupole: -95.0512 -97.6341 -102.6872
quadrupole: -8.4848 -9.6912 -1.4388
quadrupole: 3.4063 0.8234 -4.2297 -8.4848 -9.6912 -1.4388
hfenergy: -841.7511789 hartree
pointgroup: C01[X(C11H22N2O4)]
dipole: 0.9974623 0.0314527 0.0818215 debye
polarizability: 151.6834908|4.0812527|163.9630529|1.3813909|9.3122283|121.509763 unknown
InChI: InChI=1S/C11H22N2O4/c1-4-8(5-2)11(3,6-16-9(12)14)7-17-10(13)15/h8H,4-7,12-13H2,1-3H3
charge 0 multiplicity 1
39 atoms
O  -1.766515 -1.405623 0.605877
O  2.404057 -0.550765 0.03007
O  -3.487448 -0.713107 -0.864033
O  2.218674 -2.816628 -0.636008
N  -3.099138 -2.97122 -0.352737
N  4.050987 -1.474663 -1.225897
C  0.023327 0.241917 -0.00599
C  0.435332 1.772076 0.053885
C  0.289087 2.389674 1.478465
C  -0.204954 2.681955 -1.041254
C  -1.3137 0.003982 0.749449
C  1.091885 -0.62243 0.722491
C  -0.091545 -0.256985 -1.470075
C  1.035387 3.731662 1.653548
C  -1.729104 2.944735 -0.970791
C  -2.85094 -1.619744 -0.269629
C  2.837443 -1.723992 -0.62059
H  1.523662 1.766173 -0.175648
H  -0.78004 2.539536 1.726619
H  0.683004 1.679657 2.232633
H  0.037097 2.265699 -2.036991
H  0.318165 3.657903 -0.99821
H  -2.110898 0.662342 0.37151
H  -1.197303 0.141727 1.837817
H  0.769839 -1.678001 0.758873
H  1.291999 -0.254774 1.744009
H  -0.180978 -1.357207 -1.499035
H  -0.972537 0.171392 -1.976367
H  0.810494 0.019436 -2.044235
H  2.105329 3.625506 1.391478
H  0.609515 4.527061 1.015932
H  0.977328 4.081015 2.701089
H  -2.037111 3.336137 0.016764
H  -2.015131 3.702513 -1.724115
H  -2.325969 2.038935 -1.180245
H  -2.508969 -3.633811 0.144716
H  -3.859797 -3.293077 -0.943841
H  4.484363 -0.557638 -1.152856
H  4.507702 -2.228066 -1.731176
