program: Gaussian 09
title: 000089532
version: EM64L-G09RevD.01
frameworkgroup: C1[X(C15H24)]
method: RPBEPBE
basis: SDD
operation: Freq
keyword: #p
keyword: freq=noraman
keyword: PBEPBE/SDD
title: #p freq=noraman PBEPBE/SDD
converged: YES YES NO NO
title: Mulliken charges:
elementType: C C C C C C C C C C C C C C C H H H H H H H H H H H H H H H H H H H H H H H H
charge: -0.264876 0.269041 -0.188434 -0.212513 -0.456585 -0.062451 0.326262 -0.755242 -0.755418 -0.472835 -0.494867 -0.579880 0.138965 -0.768449 -0.834370 0.229427 0.227367 0.198739 0.192990 0.197912 0.209984 0.213790 0.209581 0.210853 0.214735 0.206890 0.211229 0.197925 0.208840 0.217191 0.197943 0.216452 0.215522 0.214765 0.203798 0.225287 0.246762 0.223817 0.219857
chargesum: 0.00000
title: Mulliken charges with hydrogens summed into heavy atoms:
elementType: C C C C C C C C C C C C C C C
charge: -0.035450 0.269041 0.038933 -0.013774 -0.065684 0.147533 0.326262 -0.121019 -0.122564 -0.066070 -0.079733 -0.147906 0.138965 -0.124599 -0.143934
polarizability: 1.73133574e+02 7.47786001e+00 1.71416300e+02 2.17286823e+00 -7.06720413e-01 1.19020633e+02
1716.lowfreq: -12.3759 -0.0004 0.0002 0.0003 6.4878 15.7086 49.6549 102.6413 118.2080
frequency: 49.3868 102.6112 118.1971 124.7293 149.9435 165.0546 174.9951 196.9695 203.2894 225.9407 235.5243 264.0713 264.2032 303.5155 317.0269 333.9914 371.7817 383.3305 426.3795 442.6106 468.0774 493.3801 498.2492 547.0705 577.5951 627.4326 688.0428 734.8590 778.0373 821.7409 844.3319 867.0077 893.6605 904.0174 926.5867 946.3869 949.3381 953.1881 977.0096 988.1792 1001.0048 1010.1962 1030.9474 1046.2189 1062.4079 1067.6540 1076.1365 1083.3856 1109.2605 1129.3022 1139.5412 1145.8570 1155.5314 1172.2426 1193.1587 1202.2230 1219.7498 1233.3914 1241.2095 1247.2420 1263.0092 1283.5261 1295.6599 1308.5859 1312.1207 1318.6952 1342.4868 1347.6010 1365.9821 1383.9142 1385.4131 1390.5546 1399.1043 1427.6506 1454.2317 1457.1506 1464.5042 1465.7136 1467.7173 1471.0805 1474.4452 1475.8300 1477.6848 1480.2862 1485.0493 1491.2580 1690.0912 2926.3610 2936.6140 2953.5307 2954.3564 2956.1516 2956.6976 2962.4623 2965.1257 2968.3116 2979.2945 2982.1995 3020.3473 3034.1816 3040.2130 3042.2023 3046.8638 3051.1487 3059.2866 3060.0357 3062.6141 3064.8990 3078.6996 3083.6321 3093.2224
redmass: 2.8774 2.7797 1.6719 1.4927 2.2904 1.5788 1.3354 2.1360 1.3764 1.3654 1.3945 2.2033 2.5714 2.5535 2.7959 2.8633 2.6141 2.9870 2.6840 2.9585 2.7763 2.3597 2.8789 3.1460 2.5093 3.2750 3.5017 2.6314 2.2672 1.9822 2.1000 2.2585 2.0515 1.9983 1.8077 1.3699 1.3757 1.4356 1.7474 1.5136 1.6730 1.6353 1.6657 2.4497 1.8484 1.7622 1.8171 1.8107 1.9867 2.0003 1.9297 2.0733 1.8914 2.1310 1.6826 1.6858 1.4823 1.7178 1.5250 1.3801 1.5286 1.3217 1.3791 1.4456 1.6244 1.5633 1.5991 1.5573 1.6040 1.2686 1.2219 1.2066 1.2604 2.3683 1.0999 1.0855 1.0493 1.0628 1.0646 1.0721 1.0802 1.0653 1.0568 1.0639 1.0491 1.1687 8.0480 1.0604 1.0794 1.0774 1.0457 1.0655 1.0374 1.0905 1.0362 1.0383 1.0639 1.0697 1.0958 1.0936 1.0948 1.0990 1.0984 1.1015 1.0978 1.0985 1.0897 1.0987 1.0923 1.0951 1.0949
irintensity: 0.0090 0.0954 0.2138 0.4610 0.1538 0.3359 0.0164 0.1016 0.2469 0.3120 0.5675 0.5717 0.2192 2.6866 1.1310 1.6376 0.7492 0.6920 0.7003 0.4573 1.1654 0.1530 3.1932 0.4155 1.0134 2.9882 1.8704 1.2780 4.6077 4.1504 0.7914 1.6092 2.8677 1.9210 1.8939 2.3907 10.1187 0.0889 8.8053 0.5307 2.2438 4.0653 7.9941 1.7803 0.9265 0.7224 2.2243 0.8360 0.9545 0.2869 19.0540 1.0767 0.0312 2.1384 2.3757 2.5801 4.3614 1.0559 0.0720 1.0376 2.3368 0.5315 0.8566 0.2513 1.5282 2.2197 0.4997 0.8301 0.6256 20.8294 10.2912 12.5222 10.0948 2.5071 9.2648 4.5720 0.4570 4.8674 9.3402 3.5639 14.4132 10.3393 8.0354 11.0357 12.0296 6.2005 0.3731 51.9165 1.3838 23.7247 59.2653 49.1664 42.9409 21.9278 16.8942 56.0595 62.6135 82.1669 32.3104 34.2656 14.1016 4.7259 74.5581 19.0886 62.0300 24.5530 55.6621 28.6091 36.0792 73.0412 28.6135
temp: 298.150 k
press: 1.00000 atm
elementType: 6 6 6 6 6 6 6 6 6 6 6 6 6 6 6 1 1 1 1 1 1 1 1 1 1 1 1 1 1 1 1 1 1 1 1 1 1 1 1
symmnumber: 1
zpe: 917309.7 jmol-1
zpe.correction: 0.349385 hartree
zpe.thermalcorrener: 0.365283 hartree
zpe.thermalcorrenthalpy: 0.366227 hartree
zpe.thermalcorrgfe: 0.308078 hartree
zpe.sumelectzpe: -584.775613 hartree
zpe.sumelectthermal: -584.759715 hartree
zpe.sumelectthermalent: -584.758771 hartree
zpe.sumelectthermalfe: -584.816919 hartree
dipole: 0.0266 -0.0800 0.0132
dipole: 0.0853
quadrupole: -93.3473 -92.4516 -93.1819
quadrupole: -0.1800 -0.0130 -0.3685
quadrupole: -0.3537 0.5420 -0.1883 -0.1800 -0.0130 -0.3685
hfenergy: -585.1249977 hartree
pointgroup: C01 [X(C15H24)]
dipole: -0.0122197 -0.0308494 -0.0050176 debye
polarizability: 172.1083075|-7.4886974|172.3163088|3.5101162|-0.3505797|119.1458913 unknown
InChI: InChI=1S/C15H24/c1-9-6-8-12-14(15(12,3)4)13-10(2)5-7-11(9)13/h10,12-14H,5-8H2,1-4H3
charge 0 multiplicity 1
39 atoms
C  -0.999485 0.035673 0.634172
C  -2.389278 -0.294851 0.025138
C  -1.383631 -1.425151 0.343516
C  0.141613 0.680484 -0.149862
C  -0.566007 -2.179691 -0.697223
C  0.378664 2.174263 0.243907
C  1.524305 0.011202 0.03389
C  -3.585141 -0.167969 0.971191
C  -2.740998 0.067654 -1.416695
C  0.854913 -2.490914 -0.167721
C  1.837852 2.428671 -0.202891
C  2.576973 1.124391 0.19114
C  1.822969 -1.322211 0.04485
C  -0.65504 3.15225 -0.339831
C  3.250194 -1.810007 0.276896
H  -1.013068 0.337456 1.691374
H  -1.634559 -2.039351 1.220636
H  -0.104281 0.680159 -1.234054
H  -0.483993 -1.606913 -1.639029
H  -1.071728 -3.132626 -0.95399
H  0.345097 2.236423 1.353794
H  -3.31055 -0.432933 2.009244
H  -3.976692 0.868368 0.980335
H  -4.410658 -0.837793 0.65999
H  -3.083508 1.118834 -1.481392
H  -1.897287 -0.049385 -2.117576
H  -3.564381 -0.576553 -1.782056
H  1.348712 -3.204338 -0.86355
H  0.762327 -3.046301 0.792623
H  2.279259 3.329828 0.26056
H  1.867055 2.568038 -1.302666
H  2.919289 1.190719 1.245542
H  3.477174 0.951783 -0.426548
H  -0.446583 4.192642 -0.027141
H  -0.639643 3.123149 -1.446926
H  -1.679115 2.897588 -0.009218
H  3.923373 -1.017378 0.640878
H  3.686923 -2.226771 -0.654225
H  3.261336 -2.630541 1.02222
