program: Gaussian 09
title: 000089479
version: EM64L-G09RevD.01
frameworkgroup: C1[X(C14H22O2)]
method: RPBEPBE
basis: SDD
operation: Freq
keyword: #pfreq=noraman
keyword: PBEPBE/SDD
title: #p freq=noraman PBEPBE/SDD
converged: YES YES NO NO
title: Mulliken charges:
elementType: O O C C C C C C C C C C C C C C H H H H H H H H H H H H H H H H H H H H H H
charge: -0.250131 -0.213107 -0.129657 0.379401 0.303100 0.212971 -0.564152 -0.549376 -0.514344 -0.485593 -0.440054 -0.428693 0.141011 -0.751779 -0.757317 -0.762459 0.194478 0.220767 0.239409 0.218280 0.244135 0.230556 0.193472 0.241463 0.219191 0.187102 0.204405 0.197868 0.235317 0.205737 0.206712 0.262843 0.206110 0.216885 0.223779 0.231215 0.199734 0.230720
chargesum: 0.00000
title: Mulliken charges with hydrogens summed into heavy atoms:
elementType: O O C C C C C C C C C C C C C C
charge: -0.250131 -0.213107 0.064821 0.379401 0.303100 0.212971 -0.103976 -0.086961 -0.090316 -0.024939 -0.048547 0.004492 0.141011 -0.076487 -0.110542 -0.100791
polarizability: 1.62000462e+02 5.25538661e+00 1.39709835e+02 -2.72719331e+00 -3.04250913e+00 1.33211108e+02
1716.lowfreq: -15.3145 -0.0008 -0.0005 0.0006 15.6178 20.5511 62.9002 100.5941 140.8602
frequency: 62.8456 100.5577 140.8497 183.3914 188.5847 196.2969 207.7523 237.4673 250.2243 264.6686 278.4840 297.3093 302.4450 340.2169 349.2931 360.6983 377.0673 415.8514 432.3489 464.6441 491.8493 498.1198 513.2221 543.8659 603.0399 647.0330 665.8919 708.5220 724.4827 785.8385 821.6082 834.5048 861.5582 866.8454 880.3809 913.5076 919.2220 933.7646 943.0254 946.9703 985.7760 999.8145 1010.2586 1022.4345 1034.6262 1048.6153 1065.9883 1074.3314 1084.8663 1106.7196 1133.7311 1148.4069 1168.3903 1180.9917 1193.3903 1197.9365 1200.7798 1221.3213 1233.6955 1259.3190 1271.4188 1287.3804 1296.6657 1302.4262 1319.0944 1328.0565 1332.5709 1337.6280 1349.0270 1354.9710 1378.8955 1396.3539 1398.8789 1446.6856 1453.8615 1458.9611 1463.8859 1466.7244 1468.3134 1474.2987 1475.3418 1478.1915 1481.8184 1488.3107 1501.2281 1665.3099 2950.3262 2956.2400 2965.1935 2977.6868 2979.9104 2986.6934 2990.0332 2995.6070 2999.2687 3006.1975 3022.1519 3041.1134 3045.0523 3052.5359 3058.3107 3058.9529 3061.7717 3066.1018 3070.1268 3082.9265 3093.5922 3101.9150
redmass: 4.1221 3.0738 3.2162 1.8122 1.6169 1.1721 1.6370 2.0387 1.1407 2.4679 2.8983 2.5638 2.6549 2.5940 3.1104 2.1864 2.8093 2.7374 3.4256 2.5434 5.0292 4.1872 3.2492 2.1986 4.5392 3.7864 3.5817 2.7398 5.8699 1.9214 1.9932 1.7803 5.1748 1.9390 2.0909 1.8893 2.1354 1.5088 1.8682 1.9742 1.7118 1.5720 1.9631 2.6215 1.8346 3.1576 2.3828 1.7489 1.8926 1.7638 1.3468 1.8248 2.8040 2.4970 2.3870 2.0889 1.6936 1.8575 1.2627 1.6288 1.5800 1.5737 1.6406 1.3382 1.4572 1.6368 1.7241 1.5587 1.4778 1.5696 1.1965 1.2114 1.2048 1.0868 1.0719 1.0737 1.0775 1.0581 1.0638 1.0740 1.0630 1.0642 1.0707 1.0672 1.0588 11.5799 1.0656 1.0783 1.0361 1.0619 1.0393 1.0413 1.0546 1.0616 1.0651 1.0621 1.0950 1.0993 1.1018 1.1012 1.0992 1.0988 1.1006 1.0980 1.1033 1.0993 1.0992 1.0978
irintensity: 1.8523 1.1878 0.8279 0.4947 0.2170 0.3090 0.7071 0.2132 0.1787 1.7680 2.8000 0.6002 0.5501 2.1372 1.3182 0.5386 1.7294 0.8856 0.9051 0.6795 1.1747 0.7581 3.8803 2.5601 1.1719 0.1451 1.1473 3.5615 4.9430 1.1648 2.3848 3.5562 20.1109 2.2099 3.1948 2.5639 27.4191 2.0192 25.3080 6.4179 7.4601 22.0482 41.2597 3.4318 0.9944 113.1814 13.1594 16.9399 3.6793 7.6651 0.6458 7.7083 4.4218 4.2645 22.7050 1.2009 1.3987 6.3036 1.4481 13.6953 7.4260 0.5436 1.5252 4.5088 1.6023 12.2806 3.6830 2.4817 0.6846 3.7870 19.6174 21.6205 18.7446 4.2410 0.6373 5.0621 10.7437 2.5556 4.2903 18.7462 10.7299 3.3859 10.4474 20.6662 12.4879 295.8851 19.7958 32.0190 41.4081 30.2096 18.8299 3.1300 53.5221 48.2731 32.1202 47.2814 45.5643 17.8715 6.4154 20.9787 10.7838 18.6666 60.7576 68.0175 43.3769 29.9904 24.0829 15.7250
temp: 298.150 k
press: 1.00000 atm
elementType: 8 8 6 6 6 6 6 6 6 6 6 6 6 6 6 6 1 1 1 1 1 1 1 1 1 1 1 1 1 1 1 1 1 1 1 1 1 1
symmnumber: 1
zpe: 874252.8 jmol-1
zpe.correction: 0.332985 hartree
zpe.thermalcorrener: 0.348115 hartree
zpe.thermalcorrenthalpy: 0.349059 hartree
zpe.thermalcorrgfe: 0.293163 hartree
zpe.sumelectzpe: -695.903547 hartree
zpe.sumelectthermal: -695.888417 hartree
zpe.sumelectthermalent: -695.887473 hartree
zpe.sumelectthermalfe: -695.943369 hartree
dipole: 1.7934 0.0558 -4.8108
dipole: 5.1345
quadrupole: -98.4310 -95.2846 -106.1342
quadrupole: 0.4204 8.9391 -2.0579
quadrupole: 1.5189 4.6653 -6.1843 0.4204 8.9391 -2.0579
hfenergy: -696.2365322 hartree
pointgroup: C01 [X(C14H22O2)]
dipole: -0.7322263 0.0348654 1.8823706 debye
polarizability: 161.9915041|-5.4741343|139.8139853|-2.2729459|2.958404|133.115916 unknown
InChI: InChI=1S/C14H22O2/c1-12(2)5-4-6-14-8-7-13(3,9-10(12)14)11(15)16-14/h10H,4-9H2,1-3H3
charge 0 multiplicity 1
38 atoms
O  0.475023 0.930461 -1.059229
O  2.214017 -0.130551 -2.123582
C  -0.589765 -0.317929 0.821736
C  -0.17291 1.093582 0.303663
C  -1.823664 -0.961173 0.083599
C  1.948572 -0.453414 0.336558
C  0.689041 -1.218208 0.864282
C  0.911807 1.706012 1.225538
C  -1.350432 2.055345 0.090181
C  2.165614 0.785167 1.267513
C  -2.965252 0.100963 0.016868
C  -2.529228 1.413978 -0.668005
C  1.606709 0.091594 -1.057458
C  -1.506039 -1.467456 -1.351213
C  -2.3198 -2.164332 0.931415
C  3.188017 -1.359258 0.286435
H  -0.934164 -0.143277 1.863627
H  0.907885 -1.546436 1.898021
H  0.548329 -2.134209 0.263936
H  0.483874 1.850496 2.234636
H  1.170442 2.706382 0.834077
H  -0.977924 2.949337 -0.4439
H  -1.695488 2.390964 1.089525
H  3.070751 1.333193 0.949366
H  2.355491 0.409693 2.290774
H  -3.307052 0.328658 1.049815
H  -3.832189 -0.339152 -0.51405
H  -3.377533 2.124103 -0.699151
H  -2.234993 1.221753 -1.715746
H  -0.758791 -2.282158 -1.34572
H  -2.427152 -1.877708 -1.80689
H  -1.121071 -0.669395 -2.005387
H  -2.608758 -1.844104 1.951238
H  -3.205067 -2.631625 0.460133
H  -1.543554 -2.946399 1.026969
H  4.065634 -0.809592 -0.095861
H  3.42419 -1.741096 1.296963
H  3.02323 -2.21991 -0.384875
