program: Gaussian 09
title: 000089449
version: EM64L-G09RevD.01
frameworkgroup: C1[X(C18H21NO)]
method: RPBEPBE
basis: SDD
operation: Freq
keyword: #p
keyword: freq=noraman
keyword: PBEPBE/SDD
title: #p freq=noraman PBEPBE/SDD
converged: YES YES NO NO
title: Mulliken charges:
elementType: O N C C C C C C C C C C C C C C C C C C H H H H H H H H H H H H H H H H H H H H H
charge: -0.317137 -0.073279 0.183836 0.182344 -0.448325 -0.319890 0.290309 0.156092 -0.367946 -0.424078 -0.405021 -0.342995 -0.613942 -0.627348 -0.243839 -0.216730 -0.239654 -0.240341 -0.243175 -0.526678 0.215880 0.233660 0.256141 0.241670 0.250329 0.291602 0.222878 0.187192 0.225109 0.240931 0.181121 0.223227 0.247465 0.227199 0.228172 0.223941 0.224763 0.226488 0.217347 0.240757 0.231926
chargesum: 0.00000
title: Mulliken charges with hydrogens summed into heavy atoms:
elementType: O N C C C C C C C C C C C C C C C C C C
charge: -0.317137 -0.073279 0.183836 0.182344 0.001214 -0.063750 0.290309 0.156092 -0.126276 -0.173748 -0.113419 -0.095530 0.021237 0.017931 -0.016640 0.011442 -0.015713 -0.015578 -0.016687 0.163352
polarizability: 2.29792019e+02 -5.22411391e+00 2.03164373e+02 6.54116546e+00 6.04951118e+00 1.77723946e+02
1716.lowfreq: -13.4102 -3.6530 -0.0003 0.0003 0.0006 9.0977 29.5670 42.6557 46.4506
frequency: 29.4548 42.3197 46.4077 53.3960 54.4777 61.5926 76.8086 116.9720 123.8099 144.1613 171.3797 206.3827 220.6589 239.8737 250.5278 251.5244 261.1828 301.1166 327.6002 338.5134 405.3794 408.7818 417.7448 450.9481 470.0821 472.2379 507.5848 566.5432 593.6336 612.1626 624.5794 659.4694 701.5589 707.8398 746.2492 762.8029 774.6793 782.0675 800.4260 860.1556 866.2355 884.6550 893.8421 932.4333 946.9330 960.8385 973.7380 981.2196 983.1580 988.8169 1001.8140 1021.0630 1027.5523 1033.9824 1036.4316 1079.6948 1085.0688 1088.7830 1096.4028 1111.1177 1136.8815 1150.0873 1158.1889 1165.8621 1167.0283 1171.0103 1187.9242 1192.7598 1230.4960 1254.9519 1261.9915 1280.8238 1318.0667 1332.3572 1356.1114 1360.8887 1369.9393 1415.1003 1418.1129 1430.4884 1437.5561 1438.0665 1457.3684 1458.4303 1459.0907 1468.8807 1472.4340 1473.7868 1476.0779 1481.1954 1486.5714 1574.5530 1579.3479 1602.3176 1607.3354 1652.7214 2837.7833 2854.8093 2897.1712 2957.2351 2973.1017 3016.2103 3019.6126 3047.9579 3074.6263 3079.2752 3094.1745 3114.3374 3120.0970 3126.1635 3129.8620 3135.8657 3143.7751 3150.1806 3153.1551 3163.6028 3165.5877
redmass: 4.5514 3.3378 3.3492 3.1633 4.3874 3.2712 3.5882 3.5566 3.7823 3.2859 1.1807 2.7855 3.0100 1.6897 2.3681 2.3825 1.3235 2.7783 2.6200 3.4504 2.9381 2.6818 3.6447 3.4277 4.1773 3.3187 4.5466 3.6287 3.7992 6.2980 5.5333 5.0621 5.0911 1.7807 2.1163 4.0784 1.6775 2.3591 3.4664 1.2444 1.4529 1.7314 2.5357 1.4552 1.4789 5.6685 2.0559 1.4719 1.3300 4.4306 1.3358 2.3133 2.3491 1.9097 1.6134 1.7108 1.6615 1.8485 2.0145 1.2389 1.5124 1.3679 1.9982 1.8065 1.1380 1.0544 2.6738 1.1472 1.9234 1.5512 2.3424 1.7937 1.3905 1.6191 3.3137 2.1612 6.2032 1.1417 1.6054 2.2455 1.4884 1.1842 1.0468 1.0600 1.0717 2.3283 1.1073 1.0530 1.0632 2.2447 1.0529 6.5865 5.8887 6.7486 5.9217 8.6544 1.0575 1.0572 1.0648 1.0315 1.0917 1.0719 1.0710 1.1036 1.1013 1.1008 1.0893 1.1009 1.0844 1.0851 1.0881 1.0897 1.0929 1.0945 1.0958 1.1011 1.1009
irintensity: 0.3605 0.3628 0.6164 3.7898 0.5633 0.4932 4.2047 3.3050 1.7944 1.2538 0.2884 3.1442 2.3073 1.7263 0.1385 0.7013 2.0965 4.1594 6.3272 0.7739 1.0019 1.4255 5.5886 3.3243 0.9384 3.1857 8.0482 11.9531 13.0463 0.5959 9.9232 3.0356 0.7880 54.7072 13.4172 9.9156 61.5291 32.9954 18.9722 0.6062 3.4023 8.0274 5.1971 6.7924 3.1626 47.8820 26.5216 0.6631 0.4659 0.3022 0.4389 38.6148 7.9177 28.1410 2.6432 3.0437 12.6565 20.0554 26.4027 0.8832 2.0805 0.4056 3.5697 11.2402 2.3174 0.0510 46.9844 2.9443 18.0909 3.4131 3.9963 6.4436 1.9764 8.5131 8.4413 9.5791 2.1914 3.5577 18.5537 5.7720 2.9351 5.0534 13.9229 6.8280 20.4999 43.7689 28.2216 8.4828 13.9999 15.4852 12.5119 5.4906 1.8278 2.4271 3.9032 1.3374 76.8196 149.3416 87.4414 65.9624 30.5899 44.6815 49.5468 44.3541 18.1678 62.7236 17.0666 26.7990 0.5526 0.4665 11.0639 9.8527 25.8010 21.9343 11.9487 32.8759 23.7708
temp: 298.150 k
press: 1.00000 atm
elementType: 8 7 6 6 6 6 6 6 6 6 6 6 6 6 6 6 6 6 6 6 1 1 1 1 1 1 1 1 1 1 1 1 1 1 1 1 1 1 1 1 1
symmnumber: 1
zpe: 893468.4 jmol-1
zpe.correction: 0.340304 hartree
zpe.thermalcorrener: 0.360287 hartree
zpe.thermalcorrenthalpy: 0.361231 hartree
zpe.thermalcorrgfe: 0.290327 hartree
zpe.sumelectzpe: -826.967716 hartree
zpe.sumelectthermal: -826.947733 hartree
zpe.sumelectthermalent: -826.946789 hartree
zpe.sumelectthermalfe: -827.017693 hartree
dipole: -0.6974 -1.0235 0.1685
dipole: 1.2499
quadrupole: -108.1257 -118.4621 -111.5745
quadrupole: -5.0086 2.1816 -1.9056
quadrupole: 4.5951 -5.7413 1.1462 -5.0086 2.1816 -1.9056
hfenergy: -827.30802 hartree
pointgroup: C01 [X(C18H21N1O1)]
dipole: 0.1739452 0.4577442 0.045159 debye
polarizability: 229.5951796|0.8691894|202.0089734|-8.9978731|-7.9372131|179.0761848 unknown
InChI: InChI=1S/C18H21NO/c1-19(2)14-13-16(15-9-5-4-6-10-15)17-11-7-8-12-18(17)20-3/h4-13H,14H2,1-3H3
charge 0 multiplicity 1
41 atoms
O  -2.014416 -0.290536 2.053374
N  2.72648 2.758284 -0.178691
C  0.046794 0.213388 0.009962
C  -1.434942 0.207176 -0.29144
C  2.110317 1.660918 0.614284
C  0.672462 1.412341 0.2077
C  0.737025 -1.121365 -0.006228
C  -2.414481 -0.017722 0.713699
C  -1.888486 0.405556 -1.621736
C  1.856464 -1.344244 -0.85591
C  0.251053 -2.206583 0.773505
C  -3.792931 -0.04124 0.406315
C  3.994429 3.227074 0.413758
C  2.872706 2.425214 -1.608866
C  -3.265066 0.389819 -1.939931
C  -4.221572 0.161578 -0.923751
C  2.483207 -2.608208 -0.912368
C  0.884749 -3.467633 0.721926
C  2.002663 -3.675903 -0.119246
C  -1.853673 0.908716 2.896532
H  2.109394 1.997607 1.672814
H  2.707803 0.71943 0.580196
H  0.070383 2.330596 0.137033
H  -1.145138 0.568428 -2.410445
H  2.215754 -0.529159 -1.49378
H  -0.608275 -2.044616 1.432237
H  4.368153 4.098619 -0.153278
H  4.800712 2.449107 0.418063
H  3.823069 3.54639 1.457625
H  1.892103 2.135995 -2.025909
H  3.592928 1.586397 -1.796729
H  3.233235 3.312685 -2.159417
H  -4.508408 -0.234338 1.212945
H  -3.587788 0.547114 -2.974883
H  -5.29009 0.136649 -1.164859
H  3.338779 -2.761647 -1.580209
H  0.502621 -4.28971 1.337972
H  2.487433 -4.657847 -0.1626
H  -2.804077 1.474968 2.957358
H  -1.055428 1.56359 2.498656
H  -1.574347 0.537914 3.894825
