program: Gaussian 09
title: 000089443
version: EM64L-G09RevD.01
frameworkgroup: C1[X(C14H23N)]
method: RPBEPBE
basis: SDD
operation: Freq
keyword: #pfreq=noraman
keyword: PBEPBE/SDD
title: #p freq=noraman PBEPBE/SDD
converged: YES YES NO NO
title: Mulliken charges:
elementType: N C C C C C C C C C C C C C C H H H H H H H H H H H H H H H H H H H H H H H
charge: -0.686512 -0.191612 -0.179362 0.387908 0.365632 0.050399 -0.363812 -0.399819 -0.721399 -0.716931 -0.403227 -0.408146 -0.333932 -0.697554 -0.699553 0.163462 0.164334 0.204799 0.193704 0.197463 0.193839 0.212154 0.228211 0.208069 0.227045 0.222583 0.207855 0.222491 0.230488 0.217457 0.213569 0.241239 0.194186 0.210441 0.243929 0.204182 0.305584 0.290838
chargesum: 0.00000
title: Mulliken charges with hydrogens summed into heavy atoms:
elementType: N C C C C C C C C C C C C C C
charge: -0.090090 -0.028149 -0.015028 0.387908 0.365632 0.050399 0.034690 -0.008517 -0.072965 -0.059448 -0.180736 -0.177658 -0.116475 -0.048560 -0.041001
polarizability: 1.94084794e+02 -5.62127793e+00 1.50313775e+02 5.92467602e+00 1.61407806e+01 1.30437155e+02
1716.lowfreq: -29.4738 -16.6771 -6.1383 -0.0006 -0.0001 0.0007 12.9688 27.9923 64.9963
frequency: -23.2225 26.9052 64.9634 86.3621 112.2027 138.5939 159.4135 177.2119 187.1201 215.0288 221.1497 226.2803 241.1767 249.2481 267.2331 280.5346 294.1781 342.6414 363.2344 384.4455 396.7899 437.9789 462.4147 507.6576 516.1783 549.8329 564.7304 617.8085 660.2970 749.2765 762.6831 786.8471 798.4504 803.5108 819.7074 850.3812 879.3869 906.6925 950.5939 956.1924 959.5676 992.9675 997.0767 1023.3270 1027.7016 1053.8455 1063.3880 1081.8549 1095.8521 1105.2868 1111.4671 1147.2612 1171.8877 1191.5306 1209.4651 1242.0534 1246.5369 1268.2534 1272.1249 1280.1956 1289.7563 1327.4045 1330.3802 1335.6764 1365.0703 1385.7722 1387.0811 1389.9491 1392.4313 1397.7573 1453.1676 1462.9029 1465.1473 1470.9401 1475.0596 1475.5047 1477.0201 1479.8905 1480.6037 1482.8316 1484.7635 1490.1030 1592.0145 1601.8135 1635.0659 2917.4290 2956.8852 2969.7574 2970.9537 2973.3026 2975.2255 2976.5716 2978.7110 3020.2257 3023.2383 3065.2129 3066.0408 3068.1600 3068.6972 3075.5863 3079.0710 3081.3898 3084.5377 3116.5184 3130.8910 3155.6244 3583.2565 3719.5133
redmass: 3.1313 3.2248 2.9603 2.9631 2.2479 2.3144 1.9307 2.2984 1.7726 1.1644 1.4511 1.1660 2.5625 1.4058 1.2431 2.4177 2.5050 2.9230 1.1258 3.1500 2.6530 3.1112 3.2583 3.6483 3.8146 3.3881 2.6261 3.9710 2.9147 1.7565 1.9012 1.9122 1.3802 1.6218 3.4927 2.2806 1.9060 1.3692 1.2988 1.3574 1.2287 1.6150 1.6028 2.2335 2.2740 1.8643 1.8241 1.6118 2.4527 2.2370 1.8608 2.1959 1.5193 1.6477 2.4002 1.3846 1.3675 1.3964 1.4096 1.3196 1.8789 1.4379 1.5496 1.6791 1.5505 1.2008 1.2161 1.3064 1.2353 2.3329 2.2367 1.5620 1.2696 1.1628 1.0897 1.0956 1.0454 1.0827 1.1238 1.0632 1.0744 1.0750 6.9964 3.1180 1.4186 1.0815 1.0800 1.0561 1.0377 1.0396 1.0495 1.0378 1.0448 1.1000 1.1002 1.0993 1.0997 1.0992 1.0992 1.0994 1.1001 1.0998 1.0994 1.0853 1.0894 1.0986 1.0447 1.1027
irintensity: 0.3796 0.2014 0.0855 0.1999 0.0350 0.0065 0.1369 2.4522 1.2135 1.5301 7.7824 10.3471 1.2589 8.6273 184.6836 9.4328 2.1604 1.0148 6.6141 0.8306 1.8068 1.4699 2.4660 1.6496 6.4796 0.1142 3.9068 0.2805 2.0602 49.2163 10.4561 13.4604 3.8557 3.7399 3.8001 2.8044 0.7283 0.0972 4.1074 5.0314 3.9548 34.4572 9.5551 2.5085 4.4558 8.2193 13.4076 2.1543 5.7277 0.4993 8.4791 6.2881 0.4219 0.4969 0.2990 2.1690 0.9637 4.0898 1.9848 11.3374 7.1120 1.8194 12.2636 4.1924 15.0402 8.0437 11.1687 18.2569 11.2102 11.0544 85.2732 0.1547 2.6615 3.9602 22.0839 1.8175 16.1070 7.3109 3.9335 11.0964 10.2479 16.2162 0.4774 4.6028 195.6188 29.0439 24.2268 46.2531 20.5812 31.7406 79.9278 46.5868 24.2228 27.3758 23.4203 28.0585 39.2923 33.5611 86.8841 33.5646 54.7746 41.4289 54.2433 7.2544 25.7680 29.2414 25.3163 27.3866
temp: 298.150 k
press: 1.00000 atm
elementType: 7 6 6 6 6 6 6 6 6 6 6 6 6 6 6 1 1 1 1 1 1 1 1 1 1 1 1 1 1 1 1 1 1 1 1 1 1 1
symmnumber: 1
zpe: 883692.7 jmol-1
zpe.correction: 0.336581 hartree
zpe.thermalcorrener: 0.353320 hartree
zpe.thermalcorrenthalpy: 0.354264 hartree
zpe.thermalcorrgfe: 0.293396 hartree
zpe.sumelectzpe: -600.874428 hartree
zpe.sumelectthermal: -600.857689 hartree
zpe.sumelectthermalent: -600.856745 hartree
zpe.sumelectthermalfe: -600.917613 hartree
dipole: 0.1112 1.5624 1.2438
dipole: 2.0001
quadrupole: -87.9674 -92.7546 -93.0436
quadrupole: -1.1782 1.4144 6.1396
quadrupole: 3.2878 -1.4994 -1.7884 -1.1782 1.4144 6.1396
hfenergy: -601.2110091 hartree
pointgroup: C01 [X(C14H23N1)]
dipole: -0.0257479 0.2117836 -0.7574257 debye
polarizability: 194.6148321|5.407002|127.5556745|1.3917692|-14.4402806|152.6652172 unknown
InChI: InChI=1S/C14H23N/c1-5-10(3)12-8-7-9-13(14(12)15)11(4)6-2/h7-11H,5-6,15H2,1-4H3
charge 0 multiplicity 1
38 atoms
N  -0.107423 0.322953 -1.958389
C  -2.650611 -0.434852 -0.601048
C  2.472694 0.383004 -0.646244
C  -1.275347 -0.401759 0.085872
C  1.192575 -0.045414 0.088312
C  -0.069251 -0.044925 -0.604642
C  -3.577746 0.709492 -0.0882
C  3.786719 -0.212054 -0.070977
C  -3.340636 -1.815876 -0.438879
C  2.564643 1.937611 -0.694417
C  -1.195847 -0.718862 1.462554
C  1.210002 -0.373771 1.461277
C  0.028627 -0.705376 2.159574
C  -3.05254 2.1241 -0.410944
C  3.877438 -1.74989 -0.171149
H  -2.534906 -0.277021 -1.693689
H  2.421316 0.008929 -1.694239
H  -3.698719 0.600768 1.008144
H  -4.585312 0.574385 -0.5323
H  4.631868 0.240985 -0.627923
H  3.915943 0.109584 0.981542
H  -3.569843 -2.027539 0.621396
H  -2.692583 -2.629831 -0.809941
H  -4.294008 -1.843274 -0.999604
H  1.637715 2.390477 -1.090994
H  2.718375 2.336699 0.325187
H  3.413031 2.267609 -1.324068
H  -2.115106 -0.983755 1.999592
H  2.163391 -0.371145 2.000722
H  0.065078 -0.95395 3.225405
H  -3.719721 2.901993 0.003529
H  -2.044108 2.275738 0.01429
H  -2.986714 2.286446 -1.504183
H  4.836947 -2.120993 0.23405
H  3.058504 -2.236702 0.386835
H  3.805901 -2.08016 -1.22508
H  0.743961 0.552051 -2.458435
H  -0.980607 0.328324 -2.473235
