program: Gaussian 09
title: 000089429
version: EM64L-G09RevD.01
frameworkgroup: C1[X(C14H30O)]
method: RPBEPBE
basis: SDD
operation: Freq
keyword: #pfreq=noraman
keyword: PBEPBE/SDD
title: #p freq=noraman PBEPBE/SDD
converged: YES YES NO NO
title: Mulliken charges:
elementType: O C C C C C C C C C C C C C C H H H H H H H H H H H H H H H H H H H H H H H H H H H H H H
charge: -0.460338 -0.396044 -0.405068 -0.377128 -0.071062 -0.387076 -0.380642 -0.426879 -0.373031 -0.368210 -0.353125 -0.352775 -0.356694 -0.695247 -0.696942 0.190304 0.232745 0.213824 0.198881 0.193502 0.185846 0.184549 0.189865 0.195838 0.190062 0.192449 0.172943 0.228333 0.190095 0.188331 0.207271 0.188511 0.187930 0.186839 0.199362 0.193315 0.194224 0.195046 0.328913 0.210773 0.209963 0.216938 0.209746 0.209399 0.214462
chargesum: 0.00000
title: Mulliken charges with hydrogens summed into heavy atoms:
elementType: O C C C C C C C C C C C C C C
charge: -0.131425 0.027005 0.007637 0.002220 0.113488 -0.001373 0.001870 -0.025603 0.005395 0.027573 0.021644 0.039902 0.032576 -0.057573 -0.063335
polarizability: 1.90137373e+02 1.58668594e-01 1.46966187e+02 1.81905432e+00 1.30895641e+00 1.34814852e+02
1716.lowfreq: -12.5690 -5.9105 -0.0011 0.0004 0.0010 8.4907 15.2655 27.8422 40.7142
frequency: 13.3418 26.2670 40.4772 46.1723 69.3376 72.8455 86.0034 102.9602 108.9299 122.4132 126.6989 144.0989 149.0538 160.5677 188.4424 222.4073 229.2945 233.0396 277.5493 287.7157 306.2054 320.2166 366.8010 423.0562 443.3074 466.7538 485.4694 595.4494 719.1136 723.6079 732.1180 734.2744 758.0885 789.7588 810.2722 839.6639 873.3485 887.7456 895.4760 929.2950 931.8329 971.3889 989.0362 995.0852 1018.2709 1022.8955 1037.8381 1041.0586 1063.6504 1076.5051 1079.1301 1081.0082 1081.5510 1098.3718 1112.7573 1126.4616 1149.0765 1183.8168 1197.4350 1209.2273 1217.7943 1226.7149 1246.7311 1255.7212 1256.4780 1273.7217 1279.4769 1281.6951 1288.6849 1289.4659 1291.6171 1295.2115 1297.2852 1309.5850 1320.5844 1342.6423 1346.6808 1353.8316 1355.3591 1356.2392 1370.3240 1387.3389 1388.7830 1390.8452 1454.7859 1459.9324 1460.3349 1463.7839 1465.5661 1466.5818 1468.5626 1473.4604 1476.5512 1477.4100 1477.8958 1480.8805 1485.4140 1487.8828 1489.4472 2913.9706 2946.6067 2947.6636 2948.1246 2949.2710 2952.9103 2956.4979 2959.4627 2966.8209 2968.1018 2968.8421 2970.4942 2973.0551 2981.1821 2982.6781 2986.4870 2995.0624 2998.1880 3008.3256 3020.0498 3021.3418 3027.0350 3037.6195 3040.0277 3052.6154 3067.1648 3069.1213 3069.7193 3072.0995 3553.0521
redmass: 2.8826 2.0428 3.2073 3.1759 1.9573 1.8265 1.8904 2.8554 3.2419 2.9234 1.8700 2.3312 2.3362 2.4997 2.4285 3.0730 1.1301 1.1518 2.5619 1.2752 2.9308 2.9542 3.0671 2.6810 3.2091 2.9772 3.0136 2.5420 1.0603 1.0762 1.0957 1.1192 1.2180 1.3643 1.2420 2.1916 1.3946 1.8864 1.8269 1.4719 1.5560 1.6092 4.2344 2.4164 1.3663 2.5959 2.8931 2.1994 2.6520 2.4516 2.2944 2.1189 2.1198 1.4849 2.0246 2.3936 1.8619 1.7527 1.4362 1.4815 1.3343 1.3579 1.2750 1.2727 1.2793 1.2247 1.0394 1.1702 1.2420 1.0861 1.0840 1.1279 1.1024 1.2531 1.3641 1.4344 1.4702 1.7035 1.6177 1.6301 1.6158 1.2174 1.4997 1.2481 1.0811 1.0744 1.0735 1.0669 1.0696 1.0803 1.0733 1.0767 1.0429 1.0530 1.0631 1.0801 1.0877 1.0894 1.0921 1.0829 1.0588 1.0656 1.0590 1.0592 1.0595 1.0601 1.0592 1.0593 1.0625 1.0604 1.0367 1.0367 1.0938 1.0648 1.0959 1.0997 1.0955 1.1019 1.0983 1.1001 1.1024 1.1044 1.1008 1.1030 1.1006 1.0994 1.1007 1.0993 1.0660
irintensity: 0.0756 0.0749 0.0502 0.0605 0.0541 0.2651 0.3130 0.5870 0.3140 0.1830 0.8385 0.1751 0.3458 3.9276 1.5061 1.0010 0.0097 0.5327 4.6779 96.2321 24.3785 20.2169 0.3317 7.1041 1.2985 1.4841 2.4201 10.8468 15.6046 0.1627 10.1672 4.1654 2.8948 2.4814 0.3789 3.3478 5.1541 5.3033 10.2363 10.5484 10.5503 27.3401 0.0685 3.0472 0.7405 8.1470 1.1185 2.3468 7.4312 1.1783 7.5691 0.3913 5.6278 16.6995 21.1647 10.7866 2.3070 3.2300 14.9443 5.6811 10.1316 15.7746 5.8774 3.7669 1.2886 0.4886 0.2946 0.9449 1.8929 1.5162 1.3091 1.2684 1.0389 2.3892 2.8948 10.1128 3.0123 0.3503 0.7794 1.0728 0.2508 11.1670 26.9193 7.0020 7.3463 0.0406 0.7531 0.1480 2.0164 2.3103 1.5116 2.2333 12.6654 6.7773 9.4526 0.8748 9.7509 39.8383 1.3861 62.6479 3.2763 32.5199 1.0110 1.8940 0.6383 9.6229 51.4584 78.4469 48.3632 126.9661 34.9642 31.0758 1.0113 61.3620 7.6862 3.2443 8.2213 4.7534 5.1254 5.7975 5.6357 107.6308 85.6946 131.6654 95.8571 60.8389 88.7603 52.2340 4.9788
temp: 298.150 k
press: 1.00000 atm
elementType: 8 6 6 6 6 6 6 6 6 6 6 6 6 6 6 1 1 1 1 1 1 1 1 1 1 1 1 1 1 1 1 1 1 1 1 1 1 1 1 1 1 1 1 1 1
symmnumber: 1
zpe: 1083750.4 jmol-1
zpe.correction: 0.412779 hartree
zpe.thermalcorrener: 0.433441 hartree
zpe.thermalcorrenthalpy: 0.434385 hartree
zpe.thermalcorrgfe: 0.360212 hartree
zpe.sumelectzpe: -625.427106 hartree
zpe.sumelectthermal: -625.406443 hartree
zpe.sumelectthermalent: -625.405499 hartree
zpe.sumelectthermalfe: -625.479673 hartree
dipole: -1.6199 1.1034 0.0295
dipole: 1.9603
quadrupole: -88.4116 -102.2475 -98.1141
quadrupole: 0.2234 1.1477 0.2416
quadrupole: 7.8462 -5.9898 -1.8564 0.2234 1.1477 0.2416
hfenergy: -625.8398844 hartree
pointgroup: C01 [X(C14H30O1)]
dipole: 0.627188 0.4483747 -0.0195545 debye
polarizability: 190.1169767|0.8734302|146.9277745|1.9030745|-1.5017969|134.8736612 unknown
InChI: InChI=1S/C14H30O/c1-3-5-7-8-9-10-11-13-14(15)12-6-4-2/h14-15H,3-13H2,1-2H3
charge 0 multiplicity 1
45 atoms
O  3.307052 -2.642168 0.716656
C  1.002518 -0.818678 0.057296
C  2.151756 -1.257847 -0.877044
C  -0.362087 -0.783128 -0.666834
C  3.508753 -1.479449 -0.182574
C  -1.527206 -0.337744 0.245293
C  -2.892204 -0.301963 -0.478387
C  4.052922 -0.269255 0.609979
C  -4.06077 0.132482 0.434916
C  4.324314 0.977757 -0.262014
C  -5.423215 0.180225 -0.293084
C  5.01767 2.118976 0.516642
C  -6.593486 0.606804 0.622406
C  5.270113 3.371491 -0.34968
C  -7.948845 0.662039 -0.115538
H  1.212799 0.187539 0.475452
H  0.954914 -1.517867 0.913937
H  1.875956 -2.214246 -1.363613
H  2.283974 -0.516344 -1.690576
H  -0.583128 -1.791274 -1.075929
H  -0.300228 -0.100543 -1.541281
H  4.25873 -1.750377 -0.962033
H  -1.30576 0.668832 0.658793
H  -1.591027 -1.023325 1.115991
H  -2.828675 0.388972 -1.345364
H  -3.109956 -1.30648 -0.898313
H  5.003626 -0.57156 1.102591
H  3.344732 -0.020212 1.423674
H  -4.130249 -0.564289 1.296571
H  -3.839256 1.13306 0.862567
H  3.369848 1.353581 -0.682851
H  4.957042 0.694223 -1.129953
H  -5.643663 -0.818252 -0.725991
H  -5.356425 0.8819 -1.151083
H  4.395111 2.392632 1.392998
H  5.980568 1.748349 0.924159
H  -6.368911 1.600976 1.060477
H  -6.66424 -0.099026 1.475288
H  4.146254 -2.803896 1.218376
H  4.319966 3.780062 -0.742624
H  5.915149 3.131939 -1.216229
H  5.766863 4.17105 0.230107
H  -8.208629 -0.325906 -0.540975
H  -7.915946 1.387375 -0.950492
H  -8.768625 0.964064 0.562292
