program: Gaussian 09
title: 000089407
version: EM64L-G09RevD.01
frameworkgroup: C1[X(C11H21NO3)]
method: RPBEPBE
basis: SDD
operation: Freq
keyword: #p
keyword: freq=noraman
keyword: PBEPBE/SDD
title: #p freq=noraman PBEPBE/SDD
converged: YES YES NO NO
title: Mulliken charges:
elementType: O O O N C C C C C C C C C C C H H H H H H H H H H H H H H H H H H H H H
charge: -0.277884 -0.271541 -0.253978 -0.178401 0.030148 -0.035053 -0.373296 -0.395891 -0.324806 0.014235 -0.712234 -0.714356 -0.703868 0.281298 -0.756958 0.198399 0.186603 0.229630 0.208718 0.229369 0.216125 0.221398 0.202379 0.243516 0.238481 0.211867 0.203908 0.225716 0.209157 0.225479 0.236463 0.217955 0.225578 0.249002 0.247151 0.245688
chargesum: 0.00000
title: Mulliken charges with hydrogens summed into heavy atoms:
elementType: O O O N C C C C C C C C C C C
charge: -0.277884 -0.271541 -0.253978 -0.178401 0.228547 0.151550 0.065053 0.049603 0.098971 0.257751 -0.057977 -0.054003 -0.023873 0.281298 -0.015116
polarizability: 1.57248762e+02 -3.38692825e+00 1.31249613e+02 5.51169642e+00 2.55620694e+00 1.15780896e+02
1716.lowfreq: -15.8033 -8.5996 -0.0009 -0.0007 -0.0006 9.8764 19.7000 29.8614 31.7622
frequency: 18.0407 29.8163 31.6931 48.0772 64.2800 70.0630 86.7239 131.5151 163.1531 183.5297 191.1940 200.2046 214.9010 232.3267 244.4154 265.3302 301.3111 319.5624 365.8731 380.8472 438.8742 444.1798 471.9968 562.2780 567.8734 604.3450 632.1713 679.5014 787.1816 799.1832 832.6280 866.0298 872.6831 897.6225 910.5049 920.0817 930.1245 945.6481 958.6661 990.2659 996.9619 1013.3480 1041.9972 1043.8709 1078.7850 1094.4988 1109.1274 1134.2550 1149.6078 1160.1798 1167.3516 1184.2667 1196.9526 1205.6643 1214.9246 1262.2986 1274.1419 1287.1244 1311.9643 1316.4223 1336.0173 1345.2088 1355.0880 1358.0365 1369.8262 1376.2062 1382.7500 1388.8144 1395.2051 1452.9364 1455.3511 1460.0346 1460.4049 1466.2213 1473.4432 1476.0361 1476.9913 1480.1670 1482.6577 1495.1768 1642.8651 2857.5412 2888.4925 2905.3563 2954.8677 2975.5531 2982.0497 2989.0677 2993.7481 3006.1429 3023.7295 3042.6434 3050.1651 3067.1981 3077.2454 3083.4464 3084.6888 3086.4214 3094.7984 3097.8967 3102.3839 3140.8814
redmass: 3.8073 1.4804 2.1773 4.0726 3.0697 3.0555 3.1398 3.0887 3.0069 1.2770 1.5424 2.0468 1.3921 1.3923 2.9172 2.3698 2.9504 2.9809 2.4906 3.4515 3.0150 2.2601 3.5781 2.8730 3.1277 3.9952 3.0496 5.4352 3.1084 3.4916 2.3764 2.9611 3.3771 2.3292 1.5475 1.3496 2.7552 1.7684 1.4891 2.1622 1.8272 2.7508 1.6664 2.0627 2.0589 1.7546 1.9095 2.2304 2.0759 1.7651 1.7587 2.0435 2.1993 3.3732 1.5188 1.2655 1.2203 1.3927 1.3014 1.4520 1.4686 1.3431 1.2928 1.3854 1.2794 1.3618 1.2392 1.2812 1.2304 1.0618 1.0515 1.0488 1.0708 1.0539 1.0534 1.0706 1.0574 1.0681 1.0907 1.0585 9.3422 1.0835 1.0694 1.0703 1.0815 1.0365 1.0357 1.0644 1.0357 1.0378 1.0857 1.0907 1.0913 1.0986 1.0999 1.1005 1.1015 1.0995 1.0994 1.0951 1.0998 1.1018
irintensity: 0.3455 1.8854 0.1296 2.2846 1.1620 3.2350 0.9547 0.8275 4.5142 1.1685 1.1939 3.9111 2.3750 0.1627 9.0033 0.1858 1.3475 0.3764 5.1954 8.8815 0.5041 2.6554 12.0652 2.0152 2.8983 3.0098 0.2972 5.8022 1.1372 8.6777 13.1172 21.0196 6.9060 23.1532 9.8344 7.0977 27.0611 19.0457 3.0515 11.6275 60.2494 57.6521 8.6868 67.5606 148.0350 4.2189 11.2572 7.1306 21.6837 13.7796 4.1190 23.2781 40.0750 295.7114 8.0366 13.8107 3.5485 5.1710 3.8687 1.3304 6.1392 3.7565 2.8253 1.1550 21.5128 1.6861 61.2789 24.0989 27.0721 26.1201 20.2087 7.3000 1.2817 11.9274 3.9175 13.9344 14.9203 0.8301 2.6091 18.4885 169.0015 69.3705 80.2752 83.6869 42.1048 41.9481 17.3867 67.0558 17.0998 2.6256 4.4763 14.1863 38.8011 39.1890 26.1685 46.2459 24.2854 47.4944 30.3344 8.9149 20.9898 9.4770
temp: 298.150 k
press: 1.00000 atm
elementType: 8 8 8 7 6 6 6 6 6 6 6 6 6 6 6 1 1 1 1 1 1 1 1 1 1 1 1 1 1 1 1 1 1 1 1 1
symmnumber: 1
zpe: 810662.6 jmol-1
zpe.correction: 0.308765 hartree
zpe.thermalcorrener: 0.326778 hartree
zpe.thermalcorrenthalpy: 0.327722 hartree
zpe.thermalcorrgfe: 0.260189 hartree
zpe.sumelectzpe: -710.953943 hartree
zpe.sumelectthermal: -710.935930 hartree
zpe.sumelectthermalent: -710.934986 hartree
zpe.sumelectthermalfe: -711.002519 hartree
dipole: -1.2386 -1.4920 0.1948
dipole: 1.9489
quadrupole: -95.6678 -93.4912 -89.3857
quadrupole: 4.6761 4.5846 3.6577
quadrupole: -2.8195 -0.6429 3.4625 4.6761 4.5846 3.6577
hfenergy: -711.262708 hartree
pointgroup: C01 [X(C11H21N1O3)]
dipole: 0.4938199 -0.4345095 -0.3940391 debye
polarizability: 156.8834326|-0.899239|128.3647749|7.4756905|6.4772056|119.0310634 unknown
InChI: InChI=1S/C11H21NO3/c1-8(2)11-12(5-6-14-11)7-9(3)15-10(4)13/h8-9,11H,5-7H2,1-4H3
charge 0 multiplicity 1
36 atoms
O  -2.850757 0.855361 1.052509
O  2.819583 -0.690245 -0.523357
O  3.422309 0.9636 1.014657
N  -0.747678 0.40757 0.058056
C  -1.972877 -0.250729 0.608555
C  -2.692975 -1.158485 -0.41612
C  -0.686885 1.765652 0.663116
C  0.482188 -0.39644 0.183161
C  -2.175997 2.134115 0.727572
C  1.551341 0.054252 -0.839107
C  -3.834298 -1.935247 0.280382
C  -3.205675 -0.355957 -1.630161
C  1.200844 -0.281856 -2.286013
C  3.664702 -0.122457 0.438204
C  4.870472 -1.007263 0.669681
H  -1.73836 -0.845721 1.527118
H  -1.933433 -1.889559 -0.770476
H  -0.108738 2.461176 0.030562
H  -0.229677 1.749399 1.680717
H  0.91643 -0.33095 1.210401
H  0.239632 -1.456863 -0.014685
H  -2.419747 2.852009 1.527616
H  -2.539058 2.514258 -0.247293
H  1.762339 1.131518 -0.706585
H  -4.581334 -1.230241 0.687422
H  -4.344709 -2.607506 -0.433063
H  -3.455439 -2.551176 1.118493
H  -3.99829 0.346657 -1.315147
H  -3.627772 -1.032702 -2.395348
H  -2.385078 0.224605 -2.087658
H  0.219054 0.160606 -2.528076
H  1.137773 -1.375763 -2.426376
H  1.958358 0.116574 -2.982208
H  5.247508 -1.410668 -0.283798
H  4.583612 -1.865503 1.304344
H  5.656934 -0.43512 1.183405
