program: Gaussian 09
title: 000089399
version: EM64L-G09RevD.01
frameworkgroup: C1[X(C12H14O2)]
method: RPBEPBE
basis: SDD
operation: Freq
keyword: #pfreq=noraman
keyword: PBEPBE/SDD
title: #p freq=noraman PBEPBE/SDD
converged: YES YES NO NO
title: Mulliken charges:
elementType: O O C C C C C C C C C C C C H H H H H H H H H H H H H H
charge: -0.250112 -0.255998 0.299726 0.345555 -0.282251 -0.821054 -0.378259 -0.376463 -0.420577 -0.237457 -0.239773 -0.240915 0.305971 -0.748669 0.252574 0.232053 0.236725 0.234045 0.235190 0.231282 0.216822 0.239330 0.227152 0.224950 0.230243 0.246648 0.248715 0.244547
chargesum: 0.00000
title: Mulliken charges with hydrogens summed into heavy atoms:
elementType: O O C C C C C C C C C C C C
charge: -0.250112 -0.255998 0.299726 0.345555 -0.029677 -0.118231 -0.143069 -0.145181 0.035575 -0.010305 -0.014822 -0.010672 0.305971 -0.008759
polarizability: 1.96837534e+02 -6.43724330e+00 1.28214466e+02 1.67066628e+01 1.40112273e+01 9.91087159e+01
1716.lowfreq: -11.0225 -3.4955 -0.0001 0.0003 0.0006 7.8289 21.7770 35.7273 47.0598
frequency: 21.2829 35.7208 47.0451 52.3683 59.3690 123.4191 142.3877 177.0285 207.5999 227.0836 307.2138 344.3213 382.0823 404.3206 416.9416 446.8032 515.5523 556.3006 569.2031 585.9337 616.2133 634.9289 698.0413 723.6453 758.2883 774.2048 846.7077 869.5412 915.7957 919.1597 928.7546 975.6654 987.8810 988.6349 995.4026 1002.1982 1024.4294 1040.0690 1042.4967 1067.5090 1093.2776 1130.0437 1174.5595 1197.1963 1200.3604 1236.2421 1283.1219 1321.6291 1335.3318 1356.5401 1380.9448 1382.0364 1397.1200 1435.7615 1453.2590 1454.4824 1456.5707 1469.2106 1480.3239 1488.3928 1581.6743 1609.6601 1643.9675 1648.1900 2981.0806 3005.6429 3037.8834 3054.6439 3099.8453 3108.4465 3116.5368 3124.1984 3131.7493 3138.9699 3139.4093 3146.5858 3154.0541 3166.7701
redmass: 3.8254 5.7255 3.3077 2.0629 1.4653 4.0240 2.7221 1.2478 5.4323 3.7440 3.6625 2.6559 3.2966 2.8211 3.0815 3.8316 3.0242 2.6033 3.3692 3.1346 6.2879 4.2323 1.7412 4.0211 3.4064 2.1489 1.2681 2.5742 2.1465 1.9495 1.8283 1.4089 1.8483 5.2204 1.3457 1.9040 2.2695 1.5400 1.6488 1.8228 1.6178 3.0488 1.0520 2.2984 1.3213 1.2663 2.2574 1.3688 1.3463 1.5168 1.8569 1.9233 1.2815 2.2266 1.0585 1.1190 1.0602 1.0623 1.2637 1.7157 5.5746 5.9638 9.0729 6.3180 1.0400 1.0379 1.0606 1.0957 1.0944 1.0974 1.0997 1.0845 1.0880 1.0946 1.1004 1.0917 1.0954 1.1013
irintensity: 0.1257 0.5742 0.8379 1.9304 1.5102 1.9407 2.2710 0.6851 4.3519 6.2525 1.7389 1.7209 4.4780 0.0861 13.2087 9.1619 3.9895 3.0091 4.5513 3.9355 0.1062 11.5536 46.1216 2.2295 16.7569 57.7728 1.1851 36.7563 108.2805 24.7968 16.4070 0.2645 56.6172 1.7441 1.4927 8.7333 8.6448 0.5602 10.7982 1.8988 5.7311 18.9042 0.0793 264.7552 65.2864 33.6381 12.1466 0.5523 3.6273 14.0579 26.0112 26.2014 25.2257 13.3686 14.1041 18.1038 24.3015 18.0791 30.0054 2.1185 3.4756 1.2800 166.4101 31.9169 18.6365 3.1101 30.8449 19.3335 11.3652 25.2746 6.9000 3.0403 4.6920 17.0955 14.4292 11.9664 40.9990 18.8605
temp: 298.150 k
press: 1.00000 atm
elementType: 8 8 6 6 6 6 6 6 6 6 6 6 6 6 1 1 1 1 1 1 1 1 1 1 1 1 1 1
symmnumber: 1
zpe: 598415.5 jmol-1
zpe.correction: 0.227924 hartree
zpe.thermalcorrener: 0.242244 hartree
zpe.thermalcorrenthalpy: 0.243189 hartree
zpe.thermalcorrgfe: 0.183984 hartree
zpe.sumelectzpe: -615.081562 hartree
zpe.sumelectthermal: -615.067242 hartree
zpe.sumelectthermalent: -615.066298 hartree
zpe.sumelectthermalfe: -615.125503 hartree
dipole: 0.9333 1.9684 0.7813
dipole: 2.3144
quadrupole: -76.2209 -82.8815 -79.8871
quadrupole: -6.0617 -1.4006 0.6749
quadrupole: 3.4423 -3.2183 -0.2240 -6.0617 -1.4006 0.6749
hfenergy: -615.3094868 hartree
pointgroup: C01 [X(C12H14O2)]
dipole: 0.3315818 -0.0913104 0.8430964 debye
polarizability: 196.4890272|-18.6976897|94.3364166|0.874122|-5.1915545|133.3352721 unknown
InChI: InChI=1S/C12H14O2/c1-10(8-9-14-11(2)13)12-6-4-3-5-7-12/h3-8H,9H2,1-2H3
charge 0 multiplicity 1
28 atoms
O  -3.080961 0.243352 0.40604
O  -3.310865 -0.115417 -1.888161
C  0.287062 0.654431 0.669385
C  1.624324 0.17642 0.195346
C  -0.736225 0.856181 -0.222775
C  0.125544 0.869213 2.165668
C  2.065408 0.402835 -1.141599
C  2.511907 -0.505832 1.075472
C  -2.109752 1.370863 0.099962
C  3.321865 -0.057011 -1.584261
C  3.770643 -0.968093 0.633715
C  4.182509 -0.750227 -0.700107
C  -3.592071 -0.428249 -0.70774
C  -4.489546 -1.569404 -0.276391
H  -0.58801 0.591457 -1.276329
H  0.165697 -0.096508 2.70556
H  0.937398 1.502028 2.568836
H  -0.839593 1.332208 2.420623
H  1.431868 0.969883 -1.831962
H  2.214216 -0.693907 2.112233
H  -2.1555 1.978406 1.015556
H  -2.524462 1.932411 -0.755071
H  3.636898 0.136247 -2.615904
H  4.428734 -1.498627 1.331139
H  5.160763 -1.104478 -1.043369
H  -5.020048 -1.324659 0.656829
H  -3.87131 -2.4670 -0.091257
H  -5.205393 -1.801323 -1.079338
