program: Gaussian 09
title: 000089434
version: EM64L-G09RevD.01
frameworkgroup: C1[X(C25H22ClNO3)]
method: RPBEPBE
basis: SDD
operation: Freq
keyword: #p
keyword: freq=noraman
keyword: PBEPBE/SDD
title: #p freq=noraman PBEPBE/SDD
converged: YES YES NO NO
title: Mulliken charges:
elementType: Cl O O O N C C C C C C C C C C C C C C C C C C C C C C C C C H H H H H H H H H H H H H H H H H H H H H H
charge: -0.055184 -0.224179 -0.275367 -0.216822 -0.178048 -0.075505 0.366713 0.369036 0.280068 0.130260 0.087700 0.116125 -0.393671 0.096731 -0.316578 -0.394006 -0.568772 0.506802 -0.426447 -0.581764 -0.378597 0.589530 -0.364304 -0.216367 -0.222983 -0.368857 -0.374148 -0.805744 -0.669370 -0.670213 0.241834 0.272748 0.258775 0.264628 0.232658 0.268045 0.270410 0.233613 0.235896 0.223859 0.210641 0.211485 0.226935 0.245605 0.226385 0.249946 0.243077 0.218698 0.216979 0.217401 0.246877 0.217466
chargesum: 0.00000
title: Mulliken charges with hydrogens summed into heavy atoms:
elementType: Cl O O O N C C C C C C C C C C C C C C C C C C C C C C C C C
charge: -0.055184 -0.224179 -0.275367 -0.216822 -0.178048 -0.075505 0.366713 0.369036 0.280068 0.130260 0.087700 0.116125 -0.151837 0.096731 -0.043829 -0.135231 -0.304144 0.506802 -0.193789 -0.313719 -0.108187 0.589530 -0.364304 0.017246 0.012913 0.065643 0.064273 -0.083807 0.009385 0.011531
polarizability: 4.20026320e+02 -1.14823032e+01 3.33376054e+02 3.12881585e+00 -4.78534609e-01 2.07245958e+02
1716.lowfreq: -4.4448 -0.0007 -0.0004 0.0010 2.7231 4.3964 19.2632 31.9706 35.6097
frequency: 19.1721 31.9669 35.6006 40.9670 49.9313 64.6479 83.7203 100.2318 101.7685 111.6673 127.9433 130.8744 146.5754 172.8856 181.6044 192.3175 204.1087 212.2157 229.8770 244.4750 246.7670 256.2902 270.5101 286.1006 297.0519 309.3704 346.0247 364.7084 381.6602 405.7782 417.1292 438.4514 448.4709 469.0943 477.6045 482.4914 490.9307 502.2378 524.6143 554.1999 570.3254 591.2109 601.5360 624.7428 627.7845 647.7666 664.3461 668.3372 691.2967 700.1099 708.0345 719.7153 737.6077 760.7261 770.7433 774.0704 780.4405 784.3994 786.6089 810.4120 838.5007 843.0625 874.9172 887.0639 896.7169 910.1902 918.3631 930.4479 952.0957 954.0892 970.3381 991.9051 1002.2925 1003.3945 1008.6539 1024.7963 1033.6170 1046.7163 1067.2279 1083.5472 1085.0151 1093.2621 1110.5035 1147.4072 1156.1953 1165.7587 1172.5323 1197.2588 1202.7211 1206.7342 1227.7556 1246.2383 1262.5265 1269.5816 1278.5034 1280.4517 1290.1224 1305.0540 1340.0884 1348.6612 1375.7006 1378.6609 1385.7274 1389.9999 1393.0914 1399.0093 1402.3374 1402.6056 1448.5892 1451.9362 1460.5064 1462.2392 1464.1680 1470.8626 1471.9433 1475.1069 1479.5886 1485.3487 1488.1758 1500.5978 1520.5281 1546.3022 1578.3152 1604.8409 1616.7522 1621.3013 1645.1788 1678.5178 2985.4358 2986.5470 2986.7141 2987.2308 2990.0609 3040.4182 3047.5352 3066.1680 3080.9064 3083.6621 3093.1262 3097.1382 3098.5233 3133.9202 3136.3529 3146.1766 3157.2768 3159.1980 3162.1343 3170.5877 3176.0504 3184.9865
redmass: 4.4113 5.5058 3.8815 6.5639 5.3678 3.7587 4.3481 4.6182 2.9603 4.1060 1.0586 4.9848 5.5465 1.7469 4.1571 4.1491 1.9802 1.4136 3.5529 6.6107 3.8287 4.5234 2.7909 5.2839 5.9724 3.8238 6.0450 5.3421 5.8705 4.1281 3.2726 3.2654 4.0405 3.8331 3.3603 3.5399 8.3503 3.6338 3.1259 9.0139 3.7847 6.7006 6.7224 4.9095 7.0755 4.9644 5.0279 5.2157 7.1918 5.3219 4.8092 3.3295 6.7265 2.9088 6.4555 1.7667 1.8514 1.2216 1.6886 1.7992 2.1575 2.1582 1.4556 1.5254 1.4605 2.8082 2.4469 6.0667 1.6664 2.0677 1.4506 4.0470 1.3378 4.0477 1.5458 2.8693 2.7885 1.5303 2.1328 2.1750 2.3384 1.6365 2.1084 3.1027 1.7871 1.5722 1.2555 2.3432 2.3305 2.4070 2.2265 1.3909 3.4268 1.8345 1.7124 2.1676 1.4970 1.5083 1.2426 1.4261 3.3328 3.2545 1.3981 1.2537 4.1813 4.9258 1.3526 3.3766 2.5247 3.3307 1.0464 2.4350 1.0925 1.3539 1.0536 1.0876 2.5517 1.0578 1.0969 1.1736 2.9092 7.2800 7.9880 7.6066 7.3446 7.7490 7.5013 12.9523 1.0393 1.0499 1.0371 1.0440 1.0627 1.1013 1.0995 1.0971 1.0993 1.0984 1.1012 1.1011 1.0999 1.0861 1.0891 1.0901 1.0954 1.0918 1.0926 1.1004 1.0932 1.0905
irintensity: 0.0506 0.9265 0.3068 0.2840 2.5438 0.8628 0.4870 0.8125 0.7492 0.5115 0.3697 0.8468 0.0305 0.0695 0.2993 2.0163 1.2527 0.0773 1.8774 1.3916 0.1707 1.1750 0.9890 1.7038 8.9782 2.1112 5.7920 1.5266 7.0553 14.2786 0.2597 12.7262 4.2186 2.7569 0.5504 1.1746 36.1352 0.4244 8.9909 4.0989 7.6550 5.0252 1.4398 3.0171 15.0046 16.2450 7.9617 59.6544 13.2471 1.9510 58.1408 4.8285 0.5550 14.5851 136.7216 19.4601 7.5070 7.2735 37.5414 16.1451 39.5236 34.9276 18.9324 2.9970 13.8237 0.8728 3.6738 2.2845 4.2494 5.2316 3.8098 17.7129 0.8066 123.6975 13.5050 50.5665 79.7627 9.8923 0.3420 12.7249 55.6780 22.7126 57.0814 202.7709 4.8376 11.9094 20.6164 26.0423 57.6860 145.6747 20.7914 37.1180 134.1903 14.9471 3.8298 18.2103 4.7215 62.9280 18.9110 149.5126 140.2243 32.2744 15.4037 36.3840 117.8954 24.2326 5.3504 42.3469 17.6718 17.6211 14.4712 7.6638 9.4546 23.3764 15.7934 3.5801 127.4002 2.0309 10.3235 22.6557 184.7497 62.7096 17.3428 3.8861 19.9568 157.1180 428.1576 374.7454 4.1842 43.1378 19.2357 40.7659 83.8067 3.4163 27.7482 11.4651 57.3729 50.0121 7.2640 77.4411 16.0784 0.9536 6.0169 7.2844 9.4957 2.9297 0.3323 23.2631 16.2011 5.8941
temp: 298.150 k
press: 1.00000 atm
elementType: 17 8 8 8 7 6 6 6 6 6 6 6 6 6 6 6 6 6 6 6 6 6 6 6 6 6 6 6 6 6 1 1 1 1 1 1 1 1 1 1 1 1 1 1 1 1 1 1 1 1 1 1
symmnumber: 1
zpe: 1062670.5 jmol-1
zpe.correction: 0.404750 hartree
zpe.thermalcorrener: 0.431663 hartree
zpe.thermalcorrenthalpy: 0.432608 hartree
zpe.thermalcorrgfe: 0.346750 hartree
zpe.sumelectzpe: -1704.252812 hartree
zpe.sumelectthermal: -1704.225898 hartree
zpe.sumelectthermalent: -1704.224954 hartree
zpe.sumelectthermalfe: -1704.310812 hartree
dipole: 6.0503 -1.4264 -5.7067
dipole: 8.4385
quadrupole: -155.8075 -161.9629 -196.1832
quadrupole: -0.6647 9.1794 -15.4370
quadrupole: 15.5103 9.3550 -24.8654 -0.6647 9.1794 -15.4370
hfenergy: -1704.6575618 hartree
pointgroup: C01 [X(C25H22Cl1N1O3)]
dipole: 2.4577136 -0.347711 -2.2047269 debye
polarizability: 420.4609981|-8.6358654|332.3030622|8.2419015|6.4285588|207.8842719 unknown
InChI: InChI=1S/C25H22ClNO3/c1-4-27(5-2)16-10-11-19-23(13-16)29-22-12-15(3)21(26)14-20(22)25(19)18-9-7-6-8-17(18)24(28)30-25/h6-14H,4-5H2,1-3H3
charge 0 multiplicity 1
52 atoms
Cl -5.541088 -1.800775 -0.747361
O  -1.182449 0.83521 1.803312
O  0.372896 -2.235573 0.216185
O  -2.123454 2.649411 2.938472
N  4.88161 -0.498552 0.410821
C  -0.836984 0.466201 0.306655
C  0.648119 0.224952 0.236399
C  -1.62533 -0.790328 -0.00383
C  -1.318445 1.715158 -0.427958
C  1.190277 -1.082647 0.252407
C  -1.84862 2.655205 0.476884
C  -1.006376 -2.063038 0.015424
C  1.588166 1.288002 0.24623
C  -1.766977 2.121691 1.866981
C  -3.021335 -0.744724 -0.242325
C  -1.283682 1.991607 -1.806855
C  2.569391 -1.342788 0.286867
C  3.505414 -0.266879 0.32294
C  2.969229 1.067818 0.2794
C  -1.745499 -3.249646 -0.177797
C  -2.360994 3.896003 0.047585
C  -3.137281 -3.214579 -0.408086
C  -3.741701 -1.928292 -0.441255
C  -1.796002 3.234224 -2.252373
C  -2.330394 4.179399 -1.336216
C  5.844207 0.623794 0.400113
C  5.418517 -1.875727 0.424275
C  -3.930872 -4.486442 -0.611938
C  6.139358 1.206506 -1.003871
C  5.50962 -2.544882 -0.969467
H  1.218842 2.319481 0.234747
H  -3.53789 0.219193 -0.261308
H  -0.871159 1.267015 -2.516618
H  2.88075 -2.388757 0.282139
H  3.635161 1.933395 0.282556
H  -1.215056 -4.205994 -0.148148
H  -2.7667 4.605227 0.776299
H  -1.781705 3.471674 -3.321907
H  -2.720927 5.13214 -1.709595
H  5.479276 1.425023 1.070887
H  6.785959 0.25583 0.846638
H  6.426467 -1.835847 0.876304
H  4.802292 -2.49845 1.100968
H  -4.440806 -4.485953 -1.592591
H  -3.278012 -5.372897 -0.557577
H  -4.721495 -4.587365 0.154013
H  5.216285 1.570036 -1.487871
H  6.590348 0.443844 -1.662603
H  6.844905 2.054568 -0.925266
H  6.203055 -1.994586 -1.62932
H  4.522957 -2.575303 -1.463049
H  5.878335 -3.582982 -0.872017
