program: Gaussian 09
title: 000089410
version: EM64L-G09RevD.01
frameworkgroup: C1[X(C20H20N4O13S3)]
method: RPBEPBE
basis: SDD
operation: Freq
keyword: #p
keyword: freq=noraman
keyword: PBEPBE/SDD
title: #p freq=noraman PBEPBE/SDD
converged: YES YES NO NO
title: Mulliken charges:
elementType: S S S O O O O O O O O O O O O O N N N N C C C C C C C C C C C C C C C C C C C C H H H H H H H H H H H H H H H H H H H H
charge: 0.899224 0.994156 1.214047 -0.548477 -0.519409 -0.385946 -0.212946 -0.172126 -0.414543 -0.204214 -0.567613 -0.539592 -0.499636 -0.499870 -0.461679 -0.461904 -0.270348 0.031381 -0.062134 -0.013235 -0.312425 -0.561259 0.539595 -0.342125 -0.374940 -0.442804 -0.250948 -0.008433 0.230456 0.180389 -0.823385 0.084856 0.450923 -0.323119 -0.352340 -0.079546 -0.223777 -0.202494 0.127158 -0.536032 0.273818 0.302876 0.328378 0.319649 0.290948 0.251932 0.296796 0.292225 0.230315 0.241058 0.310314 0.303056 0.285328 0.286884 0.257437 0.238298 0.232332 0.398645 0.384099 0.390730
chargesum: 0.00000
title: Mulliken charges with hydrogens summed into heavy atoms:
elementType: S S S O O O O O O O O O O O O O N N N N C C C C C C C C C C C C C C C C C C C C
charge: 0.899224 0.994156 1.214047 -0.548477 -0.519409 -0.385946 -0.212946 -0.172126 -0.015898 -0.204214 -0.183514 -0.148862 -0.499636 -0.499870 -0.461679 -0.461904 -0.270348 0.031381 -0.062134 -0.013235 -0.312425 0.015435 0.539595 -0.013747 -0.055291 -0.151856 0.297780 -0.008433 0.230456 0.180389 -0.059788 0.084856 0.450923 -0.012805 -0.049284 -0.079546 0.061551 0.084390 0.127158 0.192034
polarizability: 6.58104123e+02 4.49095787e+01 3.69477939e+02 1.90583561e+01 -7.91385215e+00 3.19091686e+02
1716.lowfreq: -6.1053 -2.4738 -1.4793 -0.0017 -0.0015 0.0008 3.0063 5.0273 6.7576
frequency: -5.8168 4.9061 6.1649 12.1373 13.0944 19.5631 25.9145 32.0287 42.0021 43.3266 51.2697 53.7431 62.2480 67.2966 69.1453 80.8790 92.1588 100.6268 102.0832 111.4343 124.7765 131.8067 137.9198 152.4652 161.2373 165.4956 175.3905 182.2747 183.2387 198.9237 205.5599 210.9127 222.3625 228.4844 235.8465 238.3259 253.0921 266.0413 273.7260 277.9705 284.3371 289.4489 297.6158 309.3200 312.4630 321.6723 323.1786 329.8819 339.2271 352.5280 367.0940 369.1241 379.0409 397.9078 406.4750 414.8919 420.6156 423.4029 436.2395 461.1358 469.3789 498.4937 505.8110 515.0030 518.8601 549.4416 552.1298 561.5156 587.6810 592.1023 597.2376 607.3547 618.1294 636.9225 645.3837 657.8958 686.0541 707.4133 717.4178 731.2117 736.1746 761.4279 781.2065 782.7746 785.7179 804.5937 834.1636 854.0998 865.1336 866.0996 898.2039 899.1025 907.8029 924.6409 933.3999 937.9757 953.7107 963.3952 968.0270 973.4410 975.7668 978.9191 988.1498 991.5285 1002.0675 1009.5517 1020.2089 1046.7504 1053.9457 1058.5582 1062.7110 1065.8538 1101.6386 1105.3552 1110.6156 1120.0581 1128.1100 1139.8855 1146.2578 1158.1229 1187.3829 1196.1940 1200.2238 1215.0713 1244.9932 1246.6443 1247.7808 1259.6610 1298.4747 1302.6862 1359.0971 1363.6246 1366.0918 1375.7579 1390.4457 1390.6081 1398.2268 1406.5677 1414.7538 1433.7353 1443.2396 1467.4653 1468.7123 1472.9040 1476.3982 1477.6187 1483.6896 1518.9993 1552.9486 1592.5749 1595.7415 1610.0694 1654.6973 1663.8063 2977.6980 2978.1868 2984.2579 3007.8036 3046.2138 3056.7102 3062.7530 3074.4574 3104.9142 3143.7799 3147.7335 3150.4791 3153.1588 3164.6015 3165.1266 3194.7159 3196.8194 3471.3549 3481.3067 3530.1941
redmass: 7.8841 8.7833 9.2379 8.6682 8.5886 9.0760 9.3478 8.2859 7.9859 5.3449 4.3819 9.8295 7.7083 8.8086 8.5218 5.3980 2.7060 9.0258 1.4747 6.4823 6.8705 9.2910 3.9591 3.8764 4.6343 1.9246 5.7323 3.4953 1.9494 5.2265 4.1556 3.0470 5.5609 6.3479 4.5192 2.1088 3.6514 4.0937 3.8262 2.5893 6.2599 3.9306 6.8440 7.7388 7.4908 8.7242 5.6725 10.7303 9.1906 8.0935 7.6573 8.1185 5.0820 7.6373 6.0459 3.0783 6.5728 7.3663 9.2834 6.0689 5.9680 4.4110 5.5697 8.0909 4.0811 9.1900 4.2312 6.9223 2.6113 5.8169 2.3250 4.9631 6.9990 6.1943 6.2119 4.1864 7.2214 8.6871 7.0766 6.4868 4.2706 4.1886 5.4907 7.7562 6.0189 2.8801 13.0801 1.2403 1.5201 16.3098 4.5471 1.5123 5.9899 4.1131 1.6884 1.8554 3.3390 2.5676 17.3001 7.8553 3.2782 9.6698 2.8252 1.7260 1.3564 4.4098 1.5956 1.2463 1.5341 2.7520 2.3024 4.6034 4.1938 1.5703 1.2574 2.6476 1.3320 1.5501 1.2690 1.4224 1.1429 1.2333 2.5697 1.4932 1.2026 2.9389 1.5456 1.8921 2.2864 1.6415 4.7321 1.3040 6.6648 7.4047 6.4044 1.2104 7.7781 1.2186 3.2281 1.3141 1.0686 1.2078 1.0600 1.0522 1.4737 2.5370 1.3914 10.7448 6.2011 8.1080 6.0128 7.5950 9.7740 12.2871 1.0406 1.0332 1.0555 1.0827 1.0690 1.0949 1.0923 1.1049 1.1001 1.0994 1.0917 1.1094 1.0911 1.0915 1.0913 1.0948 1.0959 1.0663 1.0661 1.0645
irintensity: 1.2734 0.7698 1.0857 0.3639 0.9793 0.4862 1.0923 0.4494 0.6024 2.1360 1.4656 1.7858 0.7821 1.7831 1.0363 0.4344 5.1396 0.0958 1.0475 0.1095 5.9064 0.8253 5.6628 2.9142 2.4291 46.9608 11.0586 18.6125 44.6331 14.4019 1.4467 7.6966 0.7553 5.3433 2.7325 1.6966 14.2581 19.3609 49.1165 77.9624 16.3107 7.3571 9.8567 15.7459 16.4423 32.5838 11.5323 10.7169 55.3230 16.8790 4.7870 9.5115 5.3523 3.6660 17.8449 0.1063 5.1642 2.5767 44.5833 6.1625 58.2937 27.7863 82.2686 128.2678 59.9220 50.1406 107.4532 206.1242 33.8215 155.9124 50.0344 39.7527 2.1912 37.9725 22.7794 40.4747 33.5172 29.1993 11.8395 26.4502 10.9511 3.0356 1.2766 37.0391 26.4396 6.2684 114.8645 0.3963 71.1025 130.0794 71.6734 23.8955 15.5157 31.8611 14.8144 67.5193 35.4247 42.3312 76.2786 46.1019 71.6469 34.4830 9.3673 10.1493 1.0694 360.6796 24.1526 56.2923 12.9233 6.4011 74.7127 159.4626 69.7425 68.7966 0.0915 67.4154 29.3597 113.7552 21.4381 5.6777 6.7249 12.3647 98.6193 12.2402 32.6814 143.8810 3.5779 104.6604 252.2641 109.6604 35.0687 6.2204 43.7040 64.5416 14.9442 11.6147 24.2286 22.2895 15.2590 52.0507 75.1266 101.0500 18.6274 18.0908 102.8930 174.5292 23.9011 132.2646 50.2165 2.9620 118.8043 45.4692 353.5000 77.1680 32.2880 44.2642 15.0415 10.0963 1.8776 4.9503 16.7680 28.7646 5.0365 23.7850 17.5288 0.9229 1.1388 2.5226 4.6446 3.0489 3.7976 80.7957 46.2165 76.5330
temp: 298.150 k
press: 1.00000 atm
elementType: 16 16 16 8 8 8 8 8 8 8 8 8 8 8 8 8 7 7 7 7 6 6 6 6 6 6 6 6 6 6 6 6 6 6 6 6 6 6 6 6 1 1 1 1 1 1 1 1 1 1 1 1 1 1 1 1 1 1 1 1
symmnumber: 1
zpe: 1039382.6 jmol-1
zpe.correction: 0.395880 hartree
zpe.thermalcorrener: 0.438259 hartree
zpe.thermalcorrenthalpy: 0.439203 hartree
zpe.thermalcorrgfe: 0.311569 hartree
zpe.sumelectzpe: -3161.636779 hartree
zpe.sumelectthermal: -3161.594401 hartree
zpe.sumelectthermalent: -3161.593456 hartree
zpe.sumelectthermalfe: -3161.721091 hartree
dipole: 1.8788 -0.9368 0.2200
dipole: 2.1109
quadrupole: -383.5390 -231.5834 -258.4730
quadrupole: -33.6155 7.8284 27.0393
quadrupole: -92.3405 59.6150 32.7255 -33.6155 7.8284 27.0393
hfenergy: -3162.0326594 hartree
pointgroup: C01 [X(C20H20N4O13S3)]
dipole: 0.7519621 -0.2194662 0.2758726 debye
polarizability: 653.4833808|59.7722895|349.3029604|-13.2046413|-27.5146745|343.8874064 unknown
InChI: InChI=1S/C20H20N4O13S3/c1-11-9-14(15(36-2)10-16(11)38(28,29)8-7-37-40(33,34)35)21-22-17-18(20(26)27)23-24(19(17)25)12-3-5-13(6-4-12)39(30,31)32/h3-6,9-10,17,26,30,33H,7-8H2,1-2H3
charge 0 multiplicity 1
60 atoms
S  5.744716 0.151505 -0.734619
S  -8.8131 -2.651898 1.975934
S  9.905063 -1.308879 1.387339
O  6.56399 1.404261 -0.060631
O  6.097608 -0.378813 -2.236378
O  8.270911 -1.549017 0.565359
O  2.029248 3.615774 0.600353
O  -2.803176 1.080299 1.688659
O  -1.866653 3.178029 -3.157479
O  -3.673776 2.115122 -4.192927
O  -8.038897 -4.298493 1.592931
O  9.998549 -2.896176 2.30625
O  -10.123431 -2.471619 1.044144
O  -8.913248 -2.491109 3.582602
O  9.789601 -0.199002 2.532426
O  10.987365 -1.305035 0.210879
N  -4.261789 0.723963 -0.184314
N  -4.301962 1.090954 -1.545034
N  -0.978673 1.361127 -0.799763
N  -0.035018 2.130844 -0.347684
C  3.890318 0.644396 -0.629363
C  5.903773 -1.350956 0.538072
C  2.878279 -0.190126 -1.16586
C  3.680485 1.895325 -0.042345
C  -2.320799 2.00555 -0.607475
C  1.569653 0.324995 -1.056994
C  7.122806 -1.135281 1.412247
C  1.283366 1.584658 -0.465904
C  2.353788 2.392571 0.046345
C  -3.105118 1.23658 0.48827
C  3.143515 -1.538594 -1.809664
C  -3.222816 1.814444 -1.805859
C  -5.325325 -0.073614 0.337148
C  -5.325216 -0.460139 1.704313
C  -6.377682 -0.463305 -0.534064
C  -7.402462 -1.625437 1.312211
C  -6.380471 -1.252496 2.197561
C  -7.431461 -1.254252 -0.041927
C  -2.994899 2.34433 -3.170782
C  3.127682 4.45282 1.114725
H  4.969634 -1.319435 1.122076
H  5.961983 -2.238232 -0.109422
H  4.549804 2.458527 0.313203
H  -2.197807 3.066311 -0.314161
H  0.722189 -0.252636 -1.440782
H  7.060841 -1.775812 2.313707
H  7.224598 -0.071258 1.701377
H  3.969591 -1.479566 -2.538943
H  3.42027 -2.302073 -1.056257
H  2.239592 -1.903813 -2.32299
H  -4.514906 -0.149393 2.365768
H  -6.356333 -0.148903 -1.579256
H  -6.411697 -1.556841 3.248094
H  -8.259169 -1.56026 -0.688668
H  2.632978 5.357562 1.493559
H  3.835852 4.718121 0.308178
H  3.663084 3.943389 1.93732
H  -1.700094 3.52982 -4.073194
H  -8.682601 -5.009383 1.882047
H  10.349146 -3.589329 1.67264
