program: Gaussian 09
title: 000089353
version: EM64L-G09RevD.01
frameworkgroup: C1[X(C5H10O4)]
method: RPBEPBE
basis: SDD
operation: Freq
keyword: #pfreq=noraman
keyword: PBEPBE/SDD
title: #p freq=noraman PBEPBE/SDD
converged: NO YES NO NO
title: Mulliken charges:
elementType: O O O O C C C C C H H H H H H H H H H
charge: -0.170497 -0.168386 -0.420108 -0.475597 -0.550363 0.274148 0.250127 -0.707710 -0.706065 0.267624 0.231600 0.256689 0.223974 0.229930 0.241729 0.236130 0.239833 0.378156 0.368786
chargesum: 0.00000
title: Mulliken charges with hydrogens summed into heavy atoms:
elementType: O O O O C C C C C
charge: -0.170497 -0.168386 -0.041952 -0.106811 -0.051138 0.274148 0.250127 0.002883 0.011627
polarizability: 8.60906606e+01 -3.38953046e-01 6.24559953e+01 -1.40550703e+00 4.60990024e-01 5.87788334e+01
1716.lowfreq: -13.0330 -0.0006 -0.0003 0.0004 2.8184 11.4879 97.6888 158.1263 172.9280
frequency: 97.6555 158.1247 172.9171 200.6400 254.2932 258.9533 333.6594 362.7327 382.5009 396.9998 445.8492 460.1347 489.5944 568.9461 606.3272 684.5423 724.9380 760.5826 785.1493 803.4977 813.5766 912.7859 932.5893 961.3456 1037.6183 1049.6517 1116.1891 1140.0353 1153.1046 1186.7966 1215.1952 1282.2445 1339.7359 1385.0148 1389.6383 1420.6978 1441.9149 1454.6578 1462.1136 1468.5074 1471.1483 3000.1112 3011.5484 3053.5869 3096.6746 3112.9479 3117.3133 3124.0091 3131.5337 3372.2397 3558.5428
redmass: 6.5707 3.3301 1.0747 1.0878 2.9110 2.5265 2.8810 1.8221 2.1596 4.7048 1.8918 4.2155 3.4545 3.9150 5.2508 1.2420 4.8514 4.7085 6.9333 5.1331 4.6130 2.0048 2.0654 1.5639 1.3391 1.8249 1.7150 2.4100 2.0912 1.8225 1.9800 1.4626 2.3287 1.2048 1.2212 1.6430 1.1296 1.0588 1.0583 1.0525 1.0474 1.0363 1.0352 1.0604 1.0984 1.0998 1.1014 1.1018 1.1046 1.0648 1.0655
irintensity: 0.9272 0.7953 0.7784 0.1852 9.1422 7.5235 2.3908 48.7067 50.8953 8.5239 2.2418 16.0634 5.6693 7.3365 23.9056 137.0583 60.0430 34.2638 15.5658 25.3426 22.2847 33.8853 8.3933 5.1239 12.7085 4.6802 58.2130 21.0135 176.3646 62.1424 86.0871 26.0729 26.8519 19.8917 26.0062 100.7506 17.3596 5.9542 12.0799 9.1644 5.6873 12.1996 10.9189 8.6960 14.1693 11.2016 8.7274 8.9845 14.7260 96.0820 13.8591
temp: 298.150 k
press: 1.00000 atm
elementType: 8 8 8 8 6 6 6 6 6 1 1 1 1 1 1 1 1 1 1
symmnumber: 1
zpe: 395731.3 jmol-1
zpe.correction: 0.150726 hartree
zpe.thermalcorrener: 0.160424 hartree
zpe.thermalcorrenthalpy: 0.161368 hartree
zpe.thermalcorrgfe: 0.117062 hartree
zpe.sumelectzpe: -496.618041 hartree
zpe.sumelectthermal: -496.608344 hartree
zpe.sumelectthermalent: -496.607399 hartree
zpe.sumelectthermalfe: -496.651705 hartree
dipole: -2.8423 -0.5557 -2.6725
dipole: 3.9408
quadrupole: -48.7028 -55.4485 -55.5503
quadrupole: -4.5479 -2.9439 5.3876
quadrupole: 4.5311 -2.2147 -2.3164 -4.5479 -2.9439 5.3876
hfenergy: -496.7687675 hartree
pointgroup: C01 [X(C5H10O4)]
dipole: -1.0980401 -0.414317 -1.0131292 debye
dipolederiv: -0.2521416 -0.1064037 -0.0579577 -0.1727124 -0.3876758 0.021571 0.1723002 0.2180317 -0.3469196 -0.4054553 0.0817963 0.0734732 0.1929752 -0.3653686 -0.0088212 -0.1749839 0.1813203 -0.3537019 -0.4679602 0.0220141 -0.0222564 -0.1095438 -0.9713811 0.032812 0.0235239 -0.0375792 -0.5593631 -0.6567069 0.0899822 -0.155615 0.1771641 -0.9426172 -0.0205912 -0.2212976 -0.104046 -0.3510566 -0.3064604 -0.0634463 -0.009322 -0.0198543 -0.0476837 0.0131838 -0.0157544 -0.0646405 -0.0935672 0.6174761 -0.005265 0.0077175 0.2549266 1.0516733 -0.0683486 -0.2528939 -0.1575532 0.5183988 0.6480518 -0.090293 0.0327764 -0.3407062 0.9958123 -0.0006436 0.2930228 -0.0376493 0.459091 -0.1181691 0.0752219 0.0293876 -0.0284344 0.011989 0.0040186 0.0753925 -0.0139043 0.0016501 -0.1119756 -0.0790403 -0.0513531 0.0073547 -0.0653653 -0.0116207 -0.0766505 -0.0150426 0.0124716 0.124534 0.0102478 -0.0141552 0.0072377 0.0580918 0.0867753 -0.0124686 0.0562466 -0.0136837 0.0717867 -0.0031411 -0.0020242 0.0046424 -0.0937048 -0.0743143 0.0039853 -0.0370376 0.0859266 0.0093501 -0.020533 -0.0695605 -0.0335017 0.0969014 -0.0483331 -0.119998 -0.0404794 0.0179527 0.0876033 -0.0400429 0.0047471 0.0139132 -0.1203361 -0.0201496 0.004097 -0.0076819 0.1029853 0.0474335 0.0002202 0.0467052 0.0002627 0.0779223 0.0683416 0.0874128 0.0598571 -0.0656332 0.0787682 0.0571949 0.004251 0.0128595 -0.0958129 -0.0421718 -0.0080823 -0.0390665 0.102952 -0.0030246 -0.0026763 0.0777593 0.0177335 0.0986967 -0.0441298 0.1400619 -0.0220103 -0.0191788 0.0357598 0.0039364 -0.0543246 0.0081636 0.0664015 0.0712506 -0.0962727 0.0547674 -0.0328411 0.3445682 0.0664016 0.0130219 0.0709868 0.3315281 -0.0035651 0.0082125 0.0002471 0.3476555 0.2565621 0.0038262 0.1467296 -0.0634673 0.3009292 0.0447363 0.170393 0.0062206 0.1868616 unknown
polarizability: 85.92717|1.7473392|62.6295368|-1.745775|-0.0232233|58.7687824 unknown
InChI: InChI=1S/C5H10O4/c1-4(6)3-5(2,7)9-8-4/h6-7H,3H2,1-2H3
charge 0 multiplicity 1
19 atoms
O  0.816946 -0.524266 1.155536
O  -0.731812 -0.72444 1.130618
O  1.326569 1.479476 -0.128164
O  -1.426788 1.243729 -0.096393
C  0.018827 -0.388804 -1.100268
C  1.199419 0.048639 -0.194281
C  -1.189521 -0.223915 -0.167881
C  2.577563 -0.528318 -0.507289
C  -2.478208 -0.978715 -0.496209
H  -0.056505 0.244195 -1.996593
H  0.11885 -1.447519 -1.388894
H  3.293282 -0.198304 0.26327
H  2.547022 -1.629042 -0.525215
H  2.922399 -0.146967 -1.482915
H  -2.273292 -2.05077 -0.646787
H  -3.206026 -0.8807 0.329553
H  -2.925717 -0.558265 -1.41193
H  0.400561 1.851444 -0.035596
H  -2.033668 1.427741 0.666337
