program: Gaussian 09
title: 000089343
version: EM64L-G09RevD.01
frameworkgroup: C1[X(C15H16O2)]
method: RPBEPBE
basis: SDD
operation: Freq
keyword: #pfreq=noraman
keyword: PBEPBE/SDD
title: #p freq=noraman PBEPBE/SDD
converged: YES YES NO NO
title: Mulliken charges:
elementType: O O C C C C C C C C C C C C C C C H H H H H H H H H H H H H H H H
charge: -0.472729 -0.266070 -0.203792 -0.626190 0.470272 0.462036 -0.369074 -0.434145 -0.416913 -0.391387 -0.354113 -0.359651 0.319083 -0.232611 -0.222272 -0.242880 -0.537620 0.212635 0.229518 0.235144 0.235765 0.254256 0.225080 0.277826 0.250649 0.241931 0.354567 0.222848 0.222578 0.225653 0.221643 0.221227 0.246735
chargesum: 0.00000
title: Mulliken charges with hydrogens summed into heavy atoms:
elementType: O O C C C C C C C C C C C C C C C
charge: -0.118161 -0.266070 0.008843 -0.161528 0.470272 0.462036 -0.133309 -0.179890 -0.191833 -0.113561 -0.103464 -0.117720 0.319083 -0.009763 0.000306 -0.017227 0.151984
polarizability: 2.60644167e+02 -6.21388246e+00 1.58622960e+02 1.65769855e+01 9.25876426e+00 8.90379017e+01
1716.lowfreq: -9.3274 -0.0006 -0.0005 -0.0003 1.5844 6.2679 26.8785 29.1832 36.8541
frequency: 26.7158 28.5527 36.8352 55.8648 89.3457 110.4312 171.7238 196.5078 229.6412 239.7056 251.1935 320.6408 356.4108 363.1274 390.0924 403.7178 418.0830 419.6036 476.7059 501.7018 528.2826 547.4788 607.7478 616.2214 632.5738 701.8163 709.3142 730.5743 760.0157 795.7177 812.8175 823.4114 853.1817 856.0010 867.6015 922.1143 939.7384 962.6847 978.3120 986.7867 989.6019 991.0866 998.2693 1003.1351 1015.8657 1025.7441 1080.5224 1109.6799 1112.2660 1154.4099 1157.8410 1170.8985 1175.6222 1180.0048 1186.1068 1211.9368 1228.1701 1232.0062 1270.2223 1300.2540 1310.9407 1320.1208 1376.8648 1381.5523 1390.4688 1416.7220 1436.8726 1438.0958 1454.4733 1467.9696 1473.4165 1483.3353 1500.3838 1580.6968 1594.4930 1615.0351 1620.8320 2933.8355 2959.6660 2999.7725 3047.1549 3062.2819 3107.6443 3121.2896 3124.3215 3124.4493 3126.4445 3138.2263 3156.8685 3160.9668 3166.0157 3173.1743 3521.1957
redmass: 3.9359 4.2992 4.6902 4.3533 4.1110 4.4624 3.7717 3.8504 3.7030 1.6074 2.2618 3.7083 1.7545 2.5791 2.0993 2.8197 2.6992 4.7691 3.4225 3.3456 3.9618 2.5409 4.8690 6.3578 6.6247 2.7277 2.1679 4.1361 1.9649 3.4965 1.9266 1.4471 2.0816 1.3430 2.6646 1.4717 1.3770 1.3564 1.3870 4.7725 5.4771 2.6781 1.4627 2.6177 4.8074 2.1528 1.5847 1.3656 1.2624 1.3094 1.3246 1.0599 1.3098 1.2164 1.2607 2.1492 1.7297 2.3225 1.4468 1.2496 1.2528 1.3009 2.4821 5.2859 2.9282 3.3911 1.1717 2.1676 1.1114 1.0500 1.0751 2.3878 2.4641 6.9865 6.2464 6.1514 6.3962 1.0837 1.0330 1.0598 1.1039 1.1030 1.0876 1.0896 1.0865 1.0906 1.0978 1.0928 1.0982 1.0938 1.0952 1.0963 1.0654
irintensity: 0.2112 0.2153 1.2696 2.1513 0.7377 4.8072 1.2065 3.5926 1.8961 1.8937 2.6549 7.6173 58.0887 24.4444 64.9503 2.0614 13.4828 2.2643 1.8615 3.3081 17.2178 47.8965 3.0370 0.4611 0.4184 22.6741 39.7217 8.9986 34.9207 12.5720 42.0306 10.2655 13.8313 2.2922 13.4514 4.3012 1.4439 0.1237 0.4050 47.2350 0.3911 4.2258 3.9861 13.5962 37.4954 11.4895 9.8385 16.8160 0.5367 21.6867 8.0685 0.1343 51.7645 22.8723 11.7514 11.0050 85.3201 110.7182 6.6819 1.8698 1.3447 13.6507 20.0284 7.9206 14.6969 3.8328 12.5925 10.8357 8.1251 13.9818 59.9559 15.6587 131.1085 7.4115 0.6286 13.8780 45.6009 36.1383 68.3262 28.3745 49.1440 12.3374 13.9333 11.3256 0.6395 33.3912 8.8651 34.4252 34.3744 13.6419 4.8229 8.3416 13.1893
temp: 298.150 k
press: 1.00000 atm
elementType: 8 8 6 6 6 6 6 6 6 6 6 6 6 6 6 6 6 1 1 1 1 1 1 1 1 1 1 1 1 1 1 1 1
symmnumber: 1
zpe: 706384.2 jmol-1
zpe.correction: 0.269048 hartree
zpe.thermalcorrener: 0.284714 hartree
zpe.thermalcorrenthalpy: 0.285659 hartree
zpe.thermalcorrgfe: 0.224086 hartree
zpe.sumelectzpe: -730.392228 hartree
zpe.sumelectthermal: -730.376561 hartree
zpe.sumelectthermalent: -730.375617 hartree
zpe.sumelectthermalfe: -730.437190 hartree
dipole: 2.3618 -0.2526 -1.0533
dipole: 2.5984
quadrupole: -85.3540 -92.3965 -107.2110
quadrupole: -12.7661 2.9266 3.8806
quadrupole: 9.6331 2.5907 -12.2238 -12.7661 2.9266 3.8806
hfenergy: -730.661276 hartree
pointgroup: C01 [X(C15H16O2)]
dipole: -0.9326568 -0.1170999 0.4018502 debye
polarizability: 259.9613041|7.8681596|158.9638541|18.9493613|-8.4415601|89.3798701 unknown
InChI: InChI=1S/C15H16O2/c1-17-14-9-7-12(8-10-14)11-15(16)13-5-3-2-4-6-13/h2-10,15-16H,11H2,1H3
charge 0 multiplicity 1
33 atoms
O  0.813114 -1.322833 -1.114356
O  -5.302466 0.270487 -0.413908
C  1.171313 -0.008384 -0.568567
C  0.353098 0.28535 0.736214
C  -1.145497 0.26352 0.486781
C  2.66904 0.001973 -0.29714
C  -1.821542 1.410722 -0.016175
C  -1.904799 -0.915997 0.688108
C  3.350738 1.239254 -0.181024
C  3.389339 -1.20298 -0.114448
C  -3.196803 1.382383 -0.304177
C  -3.291009 -0.965585 0.404402
C  -3.937895 0.190108 -0.096869
C  4.7296 1.27462 0.123456
C  4.769912 -1.168561 0.187064
C  5.444334 0.068209 0.311439
C  -6.115599 -0.931124 -0.213785
H  0.925611 0.785417 -1.309233
H  0.672691 1.269344 1.127189
H  0.638666 -0.476953 1.484746
H  -1.261603 2.340816 -0.17428
H  -1.412458 -1.806172 1.098315
H  2.806205 2.17972 -0.33841
H  2.860463 -2.152803 -0.234135
H  -3.721134 2.264444 -0.684415
H  -3.843953 -1.893091 0.580855
H  -0.176239 -1.365422 -1.186678
H  5.246214 2.237598 0.207339
H  5.320685 -2.106943 0.32017
H  6.515032 0.092821 0.544137
H  -6.120829 -1.241973 0.849253
H  -5.758105 -1.769211 -0.843577
H  -7.131924 -0.644354 -0.520892
