program: Gaussian 09
title: 000089315
version: EM64L-G09RevD.01
frameworkgroup: C1[X(C12H22O2)]
method: RPBEPBE
basis: SDD
operation: Freq
keyword: #pfreq=noraman
keyword: PBEPBE/SDD
title: #p freq=noraman PBEPBE/SDD
converged: YES YES NO NO
title: Mulliken charges:
elementType: O O C C C C C C C C C C C C H H H H H H H H H H H H H H H H H H H H H H
charge: -0.275081 -0.255040 0.019941 0.322344 -0.533610 -0.483686 0.010496 -0.422688 -0.431972 -0.744270 -0.755663 -0.748667 0.282711 -0.761528 0.182281 0.216832 0.221801 0.196621 0.215736 0.237483 0.204106 0.204661 0.234784 0.200547 0.209628 0.218355 0.210727 0.217724 0.222095 0.209446 0.209330 0.211125 0.218187 0.246042 0.245644 0.243557
chargesum: 0.00000
title: Mulliken charges with hydrogens summed into heavy atoms:
elementType: O O C C C C C C C C C C C C
charge: -0.275081 -0.255040 0.202222 0.322344 -0.094977 -0.071329 0.247979 -0.013921 0.003360 -0.105560 -0.106398 -0.110025 0.282711 -0.026285
polarizability: 1.61807664e+02 -1.75359679e+00 1.26596515e+02 -3.94003778e-01 -3.45867738e+00 1.13910532e+02
1716.lowfreq: -25.8819 -11.3663 -8.4210 0.0006 0.0009 0.0010 7.4961 39.3277 44.0090
frequency: -9.3543 38.2259 43.7374 76.0705 81.8535 113.5776 165.5052 194.0488 210.0719 234.8975 248.5329 258.4284 269.0312 291.3733 318.3505 328.4683 354.2997 379.5816 433.0940 444.4829 456.4337 460.1716 509.9441 523.3862 569.4281 631.2250 740.0464 787.9381 813.6529 860.7940 869.0407 884.9959 909.6353 918.6614 924.4789 933.8654 935.5529 943.6566 986.5212 997.2809 1011.4328 1018.7771 1040.4945 1054.2224 1074.3272 1102.2695 1130.3949 1142.6753 1180.6288 1205.1490 1214.7054 1223.6959 1242.1884 1252.6902 1259.9888 1279.1350 1301.7001 1306.7075 1323.1284 1336.0536 1338.2143 1345.8212 1358.1784 1371.4177 1375.0128 1381.1382 1400.3284 1452.9101 1455.0226 1456.4415 1462.6353 1462.8967 1467.8244 1468.6459 1469.8427 1476.7024 1484.9423 1489.3100 1500.1201 1643.0043 2921.6401 2966.6234 2969.3020 2971.0492 2973.0469 2976.4389 2987.3539 2992.7583 3006.4903 3010.2924 3036.9362 3045.4750 3057.8189 3059.1376 3061.0532 3066.1424 3067.8069 3070.1516 3074.7414 3076.1502 3095.0546 3141.0361
redmass: 1.0749 5.0680 3.3145 3.2111 2.7966 2.5399 2.8106 2.7410 1.5476 1.4113 2.0859 1.0593 1.6987 2.7172 2.7837 2.0955 3.0104 2.2264 2.5206 3.0791 2.2278 2.3320 2.4956 2.5013 3.1405 4.5284 2.9150 2.0033 3.0707 2.2081 1.9475 1.8881 2.0355 1.7346 1.6556 1.4179 2.1943 2.7398 1.7665 1.9876 1.4290 1.6819 1.6657 1.4482 1.2147 2.5221 2.3050 2.3311 1.6484 3.3494 1.8396 2.4901 2.3780 1.3381 1.3945 1.2846 1.4471 1.2460 1.3534 1.4446 1.4789 1.6085 1.4396 1.2069 1.2065 1.2585 1.2086 1.0644 1.0479 1.0780 1.0740 1.0756 1.0724 1.0593 1.0501 1.0924 1.0535 1.0612 1.0571 9.1463 1.0818 1.0358 1.0367 1.0624 1.0585 1.0396 1.0630 1.0635 1.0367 1.0808 1.0960 1.1002 1.0997 1.1004 1.1001 1.1002 1.0991 1.0994 1.0983 1.0976 1.0973 1.1010
irintensity: 1.3302 0.6402 0.7498 1.2923 1.7213 0.1803 0.9483 5.5609 1.4325 0.1563 0.3259 0.1173 0.4434 1.0276 0.9252 0.3672 3.7509 0.7259 0.0654 2.9813 0.6955 4.3187 0.9289 3.2098 2.8702 4.1559 1.3114 1.7358 4.9942 19.3689 10.1019 5.6440 2.6201 1.6087 2.8452 2.4911 29.7978 41.4941 3.1935 120.1639 0.5087 15.7335 8.4977 1.2833 1.1296 0.1879 6.4532 3.2111 15.4277 401.6509 13.6467 11.4240 15.0511 3.5453 0.6719 7.1324 5.6322 2.3548 0.3624 0.8271 1.3887 4.8586 6.3602 27.6723 28.4912 49.3264 15.5263 26.7322 19.4090 3.3248 1.9194 2.2124 14.0247 3.5410 0.0246 7.5003 10.3134 4.5571 27.9146 184.9048 23.8450 27.2562 33.8000 27.3209 30.1341 29.6691 12.2995 19.6406 2.8861 20.9536 52.6395 41.4062 1.7649 12.2197 7.1696 111.3014 39.3546 47.7010 53.9648 56.6291 9.0809 12.4647
temp: 298.150 k
press: 1.00000 atm
elementType: 8 8 6 6 6 6 6 6 6 6 6 6 6 6 1 1 1 1 1 1 1 1 1 1 1 1 1 1 1 1 1 1 1 1 1 1
symmnumber: 1
zpe: 833364.2 jmol-1
zpe.correction: 0.317412 hartree
zpe.thermalcorrener: 0.332902 hartree
zpe.thermalcorrenthalpy: 0.333846 hartree
zpe.thermalcorrgfe: 0.274923 hartree
zpe.sumelectzpe: -619.801480 hartree
zpe.sumelectthermal: -619.785990 hartree
zpe.sumelectthermalent: -619.785046 hartree
zpe.sumelectthermalfe: -619.843969 hartree
dipole: -1.5836 -0.5743 1.3953
dipole: 2.1874
quadrupole: -89.3766 -85.8659 -90.0898
quadrupole: -5.2464 7.7282 1.6399
quadrupole: -0.9325 2.5782 -1.6457 -5.2464 7.7282 1.6399
hfenergy: -620.1188914 hartree
pointgroup: C01 [X(C12H22O2)]
dipole: 0.6293062 0.2098649 0.5481967 debye
polarizability: 161.7367022|-2.3695598|126.6072056|0.2309776|3.5753993|113.9708037 unknown
InChI: InChI=1S/C12H22O2/c1-9(13)14-11-7-5-6-10(8-11)12(2,3)4/h10-11H,5-8H2,1-4H3
charge 0 multiplicity 1
36 atoms
O  -2.199566 0.62162 0.485241
O  -3.678224 -0.240789 -1.106172
C  1.462036 -0.249485 -0.251334
C  2.821795 0.520672 -0.029634
C  0.217945 0.537599 0.255028
C  1.43357 -1.684135 0.350309
C  -1.079348 -0.20506 -0.088778
C  0.112265 -2.419568 0.021272
C  -1.121415 -1.621199 0.506246
C  2.782729 1.879773 -0.785641
C  3.10462 0.79175 1.47313
C  3.9957 -0.311931 -0.619378
C  -3.45413 0.496025 -0.117435
C  -4.468304 1.368509 0.593255
H  1.356567 -0.359633 -1.356065
H  0.269656 0.662219 1.354182
H  0.177316 1.547121 -0.190638
H  1.54818 -1.626201 1.452224
H  2.282955 -2.278212 -0.032713
H  -1.233221 -0.257445 -1.184561
H  0.041274 -2.575011 -1.075057
H  0.11044 -3.424602 0.484386
H  -2.05692 -2.128653 0.209647
H  -1.109081 -1.543758 1.611584
H  3.770326 2.375483 -0.732216
H  2.041734 2.575619 -0.353532
H  2.534291 1.734341 -1.854736
H  3.159927 -0.146446 2.054982
H  2.327106 1.432783 1.927342
H  4.073439 1.313746 1.587627
H  4.932215 0.276456 -0.592811
H  3.799606 -0.587842 -1.673585
H  4.173604 -1.241585 -0.049943
H  -4.126164 2.417558 0.608336
H  -4.575842 1.043711 1.643002
H  -5.43988 1.298971 0.083237
