program: Gaussian 09
title: 000089313
version: EM64L-G09RevD.01
frameworkgroup: C1[X(C10H12O)]
method: RPBEPBE
basis: SDD
operation: Freq
keyword: #pfreq=noraman
keyword: PBEPBE/SDD
title: #p freq=noraman PBEPBE/SDD
converged: NO YES NO NO
title: Mulliken charges:
elementType: O C C C C C C C C C C H H H H H H H H H H H H
charge: -0.440473 -0.229259 -0.464859 -0.569177 0.362107 0.277817 -0.716057 -0.572976 -0.397634 0.308215 -0.402298 0.226753 0.210390 0.225506 0.224568 0.227615 0.224897 0.215302 0.223361 0.264635 0.236567 0.214537 0.350464
chargesum: 0.00000
title: Mulliken charges with hydrogens summed into heavy atoms:
elementType: O C C C C C C C C C C
charge: -0.090009 -0.002506 -0.028963 -0.116995 0.362107 0.277817 -0.052497 -0.308341 -0.161067 0.308215 -0.187761
polarizability: 1.41269268e+02 -2.10535002e-01 1.11987005e+02 2.55515713e+00 6.43426699e+00 6.54933337e+01
1716.lowfreq: -10.9636 -0.0008 -0.0006 -0.0006 3.3979 9.9828 92.3639 124.8393 166.8169
frequency: 92.3429 124.8293 166.8152 221.6177 248.4189 303.7813 336.4979 354.8124 368.5636 423.5707 449.2243 470.6637 566.9140 602.1856 655.9767 719.9526 724.3377 767.6085 790.4351 796.6649 883.1179 894.1060 908.5018 921.7186 953.5550 969.6454 1017.5322 1072.3817 1079.1059 1103.7108 1133.0040 1159.8792 1161.5919 1180.4314 1201.7259 1251.2384 1255.1768 1280.9742 1290.0365 1308.7336 1316.8405 1381.2788 1393.1684 1449.6890 1462.6846 1469.7760 1476.9123 1478.6219 1489.6704 1596.8116 1631.1790 2969.8020 2973.0308 2990.6053 3006.7150 3039.0177 3065.6471 3071.3853 3074.9983 3107.3360 3136.7549 3150.6335 3580.6808
redmass: 3.1313 3.2214 2.6458 1.0718 2.8396 3.7476 3.3730 1.1144 2.4238 4.2933 2.8697 4.0281 4.4469 3.6778 2.6721 4.3747 3.2378 2.7173 2.3332 1.5308 1.5166 1.9760 3.0280 1.3445 1.5560 2.5050 1.6927 1.8265 1.7140 1.8491 1.4007 1.3358 1.4877 1.3991 1.7769 1.7251 1.5038 1.7602 2.0480 1.3737 1.4460 1.2035 5.4234 2.6056 1.1568 1.0788 1.1034 1.1098 2.8520 7.3488 7.0622 1.0629 1.0372 1.0741 1.0739 1.0945 1.1038 1.1002 1.1001 1.0878 1.0959 1.0925 1.0660
irintensity: 0.0202 3.4134 0.6802 0.2175 3.6090 1.6220 6.5229 141.3883 1.5498 6.3758 8.7496 1.0490 1.4956 5.9348 1.3661 2.8160 8.4765 4.1085 7.0280 45.7753 16.0116 10.8279 32.7605 0.8756 2.4652 6.2644 9.3394 15.0760 1.9311 13.6570 72.1715 35.1451 58.4503 13.7264 5.6174 24.1563 0.9724 31.3036 0.8491 2.5207 6.1247 12.8902 48.5945 3.1437 0.7611 17.1353 2.6451 9.1213 59.5461 29.1195 38.0968 34.1554 40.4003 13.3242 53.4264 34.6364 35.5854 56.7241 42.7047 17.4842 23.2763 3.5319 31.9745
temp: 298.150 k
press: 1.00000 atm
elementType: 8 6 6 6 6 6 6 6 6 6 6 1 1 1 1 1 1 1 1 1 1 1 1
symmnumber: 1
zpe: 505569.5 jmol-1
zpe.correction: 0.192561 hartree
zpe.thermalcorrener: 0.202313 hartree
zpe.thermalcorrenthalpy: 0.203258 hartree
zpe.thermalcorrgfe: 0.158036 hartree
zpe.sumelectzpe: -462.678612 hartree
zpe.sumelectthermal: -462.668860 hartree
zpe.sumelectthermalent: -462.667916 hartree
zpe.sumelectthermalfe: -462.713137 hartree
dipole: -0.1413 1.3823 0.3260
dipole: 1.4272
quadrupole: -55.6473 -64.2111 -68.4480
quadrupole: 5.4348 1.9536 1.1711
quadrupole: 7.1215 -1.4423 -5.6792 5.4348 1.9536 1.1711
hfenergy: -462.8711735 hartree
pointgroup: C01 [X(C10H12O1)]
dipole: -0.0547519 -0.5451556 -0.1229007 debye
dipolederiv: -1.2417314 -0.5248675 -0.0686059 -0.6187568 -0.3612691 0.0440792 -0.0770131 0.0410809 -0.4147866 0.0571318 -0.0179365 -0.0047397 0.045789 0.1000125 0.0197379 -0.0830687 0.054299 0.1750941 0.1153085 -0.031393 0.0421164 -0.0024419 -0.0289002 -0.0118461 -0.018696 0.0096927 0.1118131 0.0098125 0.0198479 0.042879 -0.0194505 0.0702332 -0.0490659 -0.0245248 -0.0666656 0.1495286 0.1938548 -0.0151021 0.0218165 -0.2405169 0.1327953 0.0581842 -0.0272954 0.0398331 -0.0813792 0.0124863 0.1606823 0.0106396 0.2712135 -0.1876073 -0.0328286 0.1378417 -0.0155441 -0.0912626 -0.0067048 0.0298565 -0.0275027 -0.0029064 0.0273107 0.0698989 0.0477213 0.0167678 -0.0121314 -0.3566783 -0.1243708 -0.0273566 0.1188213 0.0311642 0.0394918 0.0241851 0.0510799 -0.1667812 0.1435334 -0.1261138 -0.0354006 0.0221436 0.1235482 0.0545951 -0.0256042 0.0617083 -0.1203805 1.1658384 0.4539957 0.0389684 0.5904759 0.3150676 0.0216441 0.0489302 0.0246526 0.076577 -0.2186489 0.0099095 -0.0060365 -0.3808616 -0.1722787 0.0293948 -0.0788977 0.0022808 -0.2187949 0.0172262 0.0087381 0.0003868 0.0297449 -0.0622255 -0.1009854 0.0359434 -0.1074923 -0.0955566 -0.2141469 0.0266281 -0.0381999 0.0382748 0.0652484 -0.0007118 -0.0931283 -0.002679 0.0613262 0.0880322 0.0001388 -0.0085844 -0.0053992 0.0196337 0.0489164 0.063625 0.0482289 -0.1752664 -0.0584942 -0.042891 -0.0576882 -0.0082962 0.0735878 -0.0216791 -0.0930358 -0.0696084 -0.1297598 0.0214519 -0.0135689 0.0094385 -0.062154 -0.1395637 0.0737935 0.0572126 0.1059253 0.0485282 0.0944786 0.012529 0.0047975 -0.0149983 -0.0034201 -0.1425663 -0.0042218 -0.0757538 -0.0680487 -0.190618 0.1382442 -0.000495 0.1089665 0.0369815 0.012312 0.0046994 0.0135799 0.0647094 0.0162902 -0.1453063 0.0323687 -0.0966416 -0.0679566 0.0627903 0.0129939 0.0378948 0.0619419 0.0994133 0.0038702 0.0097007 -0.0188168 -0.0553423 -0.0422437 0.0109393 -0.0413548 0.1518635 0.0806124 -0.0167116 0.0003124 0.0055058 -0.1130859 -0.0495073 0.0116953 -0.0484782 0.1384198 -0.1374085 0.079333 0.0326671 0.0605653 0.0534481 -0.0266885 0.0293647 -0.0260727 0.1677601 0.3089606 0.1144884 0.0285181 0.1797395 0.1426182 -0.0567156 0.0403339 -0.0533753 0.366586 unknown
polarizability: 141.2728098|0.2205015|112.1106104|-2.5038423|5.9685944|65.3661866 unknown
InChI: InChI=1S/C10H12O/c1-7-2-3-8-4-5-9(11)6-10(7)8/h4-7,11H,2-3H2,1H3
charge 0 multiplicity 1
23 atoms
O  3.282456 1.087625 0.113827
C  -1.750938 0.941983 0.36895
C  -2.594374 -0.353155 0.623235
C  -1.820749 -1.507085 -0.090839
C  -0.338219 0.380993 0.205019
C  -0.379288 -1.012216 -0.070294
C  -2.206291 1.713466 -0.898719
C  0.8835 1.075318 0.258026
C  0.817676 -1.720482 -0.291636
C  2.081161 0.353145 0.039179
C  2.056598 -1.037239 -0.234517
H  -1.812078 1.631532 1.233225
H  -3.634568 -0.25138 0.264811
H  -2.628448 -0.559627 1.709636
H  -2.17484 -1.636329 -1.134214
H  -1.953878 -2.480645 0.415089
H  -2.18623 1.056808 -1.788441
H  -3.236138 2.097165 -0.774751
H  -1.54106 2.572719 -1.101334
H  0.940134 2.147755 0.471108
H  0.802965 -2.796273 -0.502073
H  2.996538 -1.582348 -0.395654
H  4.06127 0.499671 -0.04903
