program: Gaussian 09
title: 000089345
version: EM64L-G09RevD.01
frameworkgroup: C1[X(C18H18N2O2)]
method: RPBEPBE
basis: SDD
operation: Freq
keyword: #p
keyword: freq=noraman
keyword: PBEPBE/SDD
title: #p freq=noraman PBEPBE/SDD
converged: YES YES NO NO
title: Mulliken charges:
elementType: O O N N C C C C C C C C C C C C C C C C C C H H H H H H H H H H H H H H H H H H
charge: -0.295816 -0.459415 -0.336688 -0.169717 -0.377196 0.149999 0.001390 -0.084706 0.168645 0.315772 0.337895 -0.671135 -0.397803 -0.383359 -0.400151 -0.386722 -0.234972 -0.234499 -0.239368 -0.239328 -0.252153 -0.248510 0.221190 0.250456 0.203555 0.339532 0.236570 0.235154 0.208616 0.262504 0.252816 0.260408 0.263883 0.227618 0.225138 0.226757 0.223940 0.344632 0.228254 0.226814
chargesum: 0.00000
title: Mulliken charges with hydrogens summed into heavy atoms:
elementType: O O N N C C C C C C C C C C C C C C C C C C
charge: -0.295816 -0.114783 0.002844 -0.169717 0.094450 0.149999 0.001390 0.118849 0.168645 0.315772 0.337895 0.009206 -0.135299 -0.130543 -0.139743 -0.122839 -0.007354 -0.009361 -0.012611 -0.015388 -0.023899 -0.021696
polarizability: 2.92806565e+02 1.38706663e+01 2.92430212e+02 -1.23728283e+01 -1.65471419e+01 1.24220812e+02
1716.lowfreq: -5.5458 0.0002 0.0004 0.0005 0.6791 3.7482 23.9895 33.7342 41.2271
frequency: 23.7290 33.7159 41.2258 47.1999 53.5337 75.2442 79.9573 118.4205 134.8783 164.2573 183.7323 191.9911 239.9336 251.9186 262.7826 283.9885 325.6602 357.4213 359.2389 370.8109 401.3389 401.9418 408.9322 450.1330 492.8042 521.8197 557.5834 577.9773 614.2303 614.6095 624.9550 664.1447 668.4468 684.2186 693.5105 697.7958 704.4477 767.0655 775.2387 783.7208 802.0303 848.7064 860.3333 893.1249 910.2860 921.3988 929.4734 933.3361 955.1252 977.2691 985.1252 986.3090 988.7123 991.2689 994.0082 998.0511 1015.3510 1027.3498 1033.9499 1066.1952 1077.1231 1081.8008 1099.7146 1126.9793 1143.5574 1171.4415 1172.9979 1182.1606 1189.6399 1195.0154 1217.0456 1231.1022 1245.7736 1313.7417 1318.9441 1323.2925 1346.4185 1356.7853 1372.3270 1375.8118 1378.5853 1400.4139 1434.6286 1437.1789 1458.4921 1464.0674 1468.4995 1475.6962 1480.0404 1494.9967 1570.4667 1579.6590 1586.4521 1612.3934 1613.9085 1654.4434 2934.2738 2975.6171 3000.3686 3058.6713 3098.9014 3108.5761 3122.8449 3124.8940 3132.8863 3134.6681 3148.6090 3151.8090 3158.6407 3161.5698 3168.3287 3169.9301 3553.0753 3554.7907
redmass: 4.3263 3.7215 3.6180 4.5177 4.6812 4.3921 4.3766 3.9531 6.6484 4.3284 4.8504 1.1814 5.4727 5.0380 5.3628 5.6036 1.3190 1.9978 3.3374 5.2914 2.8648 2.8471 2.9198 5.2719 3.7918 3.9411 2.1112 1.8024 5.9074 6.4272 3.6585 6.7794 6.5365 6.0750 4.7381 2.0537 1.8497 1.9155 2.0747 4.3042 3.0492 1.2493 1.2478 2.6066 2.9865 1.4694 2.7164 1.7624 2.9280 1.3847 1.4066 5.8508 6.2552 4.5615 1.4339 1.3219 2.0326 2.2261 2.0473 1.5118 1.7885 1.6931 2.0513 3.2918 2.8547 1.0574 1.0552 1.7221 1.1182 1.1300 1.6818 2.8875 1.2868 1.4909 1.4327 1.3678 1.6422 2.4558 1.3699 5.7590 7.1710 1.3911 2.3669 2.3181 1.2465 1.4584 2.0648 1.0527 1.0857 2.7419 6.7830 6.2790 7.1034 6.0729 6.0752 10.6178 1.0706 1.0854 1.0368 1.0910 1.0993 1.1005 1.0846 1.0847 1.0886 1.0888 1.0933 1.0933 1.0961 1.0951 1.0998 1.1002 1.0694 1.0734
irintensity: 0.1835 0.4585 1.7865 0.3680 3.3996 1.4851 0.1276 6.2153 2.0070 0.5694 0.5040 6.1422 1.0130 1.1427 6.4302 0.1814 92.9640 51.5238 22.0885 2.5070 12.2428 0.4608 0.4707 9.5130 3.7258 5.0596 49.7926 141.8724 1.5193 0.0947 20.7904 15.6467 2.2049 18.6358 7.6416 97.8959 11.0488 81.8225 22.0201 9.0862 14.9386 1.5606 0.2477 26.3918 14.6252 10.8152 19.7849 9.4515 9.3551 1.8203 1.3884 8.1563 4.8103 31.3379 5.5599 1.5543 11.6802 4.9561 4.6149 30.1183 21.0710 4.3720 55.5158 19.6515 8.0505 0.1747 0.0438 11.4485 2.6827 0.8563 82.5728 64.6311 21.6238 13.0781 1.0525 1.0416 23.1505 21.0929 28.1937 0.4381 3.2811 42.0597 15.7785 4.8416 3.9608 53.8626 3.2376 4.2649 36.1194 60.8252 11.4472 18.3500 12.3095 32.4943 51.4919 966.6601 65.1697 97.9327 12.7845 9.2885 23.0698 39.2709 1.6500 2.2787 11.0633 9.6685 44.8497 26.4718 14.4230 16.3319 22.9941 10.9989 85.2965 80.4637
temp: 298.150 k
press: 1.00000 atm
elementType: 8 8 7 7 6 6 6 6 6 6 6 6 6 6 6 6 6 6 6 6 6 6 1 1 1 1 1 1 1 1 1 1 1 1 1 1 1 1 1 1
symmnumber: 1
zpe: 838773.7 jmol-1
zpe.correction: 0.319472 hartree
zpe.thermalcorrener: 0.339320 hartree
zpe.thermalcorrenthalpy: 0.340264 hartree
zpe.thermalcorrgfe: 0.268931 hartree
zpe.sumelectzpe: -955.088551 hartree
zpe.sumelectthermal: -955.068704 hartree
zpe.sumelectthermalent: -955.067760 hartree
zpe.sumelectthermalfe: -955.139092 hartree
dipole: 2.4042 0.4758 -0.9680
dipole: 2.6351
quadrupole: -101.7647 -122.6754 -128.6461
quadrupole: 6.2694 -8.7262 -2.6259
quadrupole: 15.9307 -4.9800 -10.9507 6.2694 -8.7262 -2.6259
hfenergy: -955.4080235 hartree
pointgroup: C01[X(C18H18N2O2)]
dipole: -0.9143399 -0.2290299 -0.4316656 debye
polarizability: 289.7445078|12.3890063|292.8283714|19.6257509|22.8377346|126.88471 unknown
InChI: InChI=1S/C18H18N2O2/c1-13(21)12-19-18-20-16(14-8-4-2-5-9-14)17(22-18)15-10-6-3-7-11-15/h2-11,13,19,21H,12H2,1H3
charge 0 multiplicity 1
40 atoms
O  -1.041321 1.291544 -0.183161
O  -5.899653 0.798363 -0.718775
N  -3.151983 0.29167 -0.539972
N  -1.098342 -0.998736 -0.381905
C  -4.052804 -0.839512 -0.76823
C  0.31537 0.804598 -0.044328
C  0.247536 -0.588985 -0.138652
C  -5.449831 -0.517579 -0.189456
C  -1.808441 0.128608 -0.387089
C  1.334729 1.846452 0.064228
C  1.283947 -1.626502 0.022748
C  -5.473461 -0.388264 1.33511
C  2.673177 1.630724 -0.376324
C  0.988559 3.130027 0.580062
C  2.433991 -1.433645 0.837284
C  1.100652 -2.886893 -0.610595
C  3.634741 2.656232 -0.276695
C  1.95387 4.153376 0.670536
C  3.38751 -2.462237 0.987047
C  2.057959 -3.912188 -0.462489
C  3.284817 3.922691 0.250056
C  3.209801 -3.704333 0.332334
H  -4.141875 -1.059477 -1.855201
H  -3.622571 -1.736379 -0.288758
H  -6.152379 -1.313758 -0.515238
H  -3.554609 1.229637 -0.587526
H  -6.485364 -0.112624 1.675481
H  -4.768232 0.391358 1.669653
H  -5.186517 -1.344068 1.808334
H  2.951644 0.667514 -0.814973
H  -0.040193 3.312791 0.905772
H  2.569851 -0.488072 1.372254
H  0.196571 -3.042933 -1.207255
H  4.657283 2.470739 -0.624488
H  1.667959 5.132107 1.072197
H  4.264125 -2.298561 1.624106
H  1.904505 -4.875021 -0.963108
H  -6.13102 0.704193 -1.678282
H  4.034741 4.717936 0.323343
H  3.952658 -4.501392 0.449155
