program: Gaussian 09
title: 000089261
version: EM64L-G09RevD.01
frameworkgroup: C1[X(C8H12O2)]
method: RPBEPBE
basis: SDD
operation: Freq
keyword: #pfreq=noraman
keyword: PBEPBE/SDD
title: #p freq=noraman PBEPBE/SDD
converged: YES YES NO NO
title: Mulliken charges:
elementType: O O C C C C C C C C H H H H H H H H H H H H
charge: -0.267157 -0.244087 -0.073304 -0.475596 -0.458608 -0.550717 -0.250124 -0.224004 0.250701 -0.506253 0.242059 0.241684 0.203677 0.218252 0.213744 0.245895 0.256084 0.233584 0.228911 0.240473 0.233235 0.241553
chargesum: 0.00000
title: Mulliken charges with hydrogens summed into heavy atoms:
elementType: O O C C C C C C C C
charge: -0.267157 -0.244087 0.168754 -0.030234 -0.026613 -0.048737 -0.016540 0.004907 0.250701 0.209007
polarizability: 1.15551322e+02 2.24739345e+00 8.20262514e+01 -1.64373238e+00 5.58363899e-03 6.81714198e+01
1716.lowfreq: -14.1191 -8.4993 -0.0007 -0.0006 0.0005 15.1498 24.0504 59.0210 74.3467
frequency: 23.2263 58.8416 74.2773 101.2887 126.9792 171.7077 256.9208 274.0530 332.7050 359.5711 492.0239 550.5203 616.1940 659.1695 729.1693 762.7821 808.2641 831.2196 852.1803 911.8591 929.1467 946.7136 955.8809 992.8297 1021.6803 1069.6100 1088.5381 1112.5475 1119.6856 1131.9857 1140.7689 1147.8451 1194.4240 1206.8174 1246.7758 1278.6985 1285.0074 1306.5495 1333.9565 1353.4249 1421.6986 1437.1751 1453.1694 1462.6452 1464.2110 1476.5372 1631.1510 1645.1575 2964.3198 2969.7634 2983.1258 2991.7352 3003.8522 3027.0620 3053.8631 3081.3702 3105.1631 3125.9595 3148.6460 3163.6248
redmass: 4.6049 3.2658 2.4608 1.0879 2.9308 3.4949 3.0461 3.8531 2.4544 3.7988 2.2520 3.0614 2.7580 3.5723 1.4228 5.2542 1.6698 4.7232 2.5984 2.0022 1.9603 1.3557 4.5554 2.3112 2.0468 1.9614 1.3824 1.2761 2.0133 1.6961 1.6709 1.4408 1.2815 1.4116 1.4014 1.2689 1.4662 1.4364 1.5994 1.7901 1.1876 1.0865 1.0502 1.0865 1.0509 1.0939 6.4037 9.0754 1.0826 1.0630 1.0637 1.0691 1.0296 1.0950 1.0957 1.0989 1.1045 1.0859 1.1047 1.1062
irintensity: 1.2330 0.0898 0.4649 0.2685 1.2409 9.6841 10.6008 5.7996 6.0228 3.0789 4.0034 3.3593 13.3624 23.0603 41.2952 3.9391 1.6685 10.4758 3.4842 7.4875 7.0806 3.9561 15.9693 10.0248 4.5234 6.3825 11.1613 3.0552 159.4227 3.6430 115.7651 7.1394 0.9872 17.3807 30.8588 1.8575 13.9884 5.8802 22.0010 19.9950 21.3504 26.4277 14.3548 4.6941 14.4223 7.2754 2.6613 156.3675 13.2157 53.5171 14.5474 25.4600 33.4835 40.9098 11.6365 32.3896 27.9808 7.0720 17.2816 33.0899
temp: 298.150 k
press: 1.00000 atm
elementType: 8 8 6 6 6 6 6 6 6 6 1 1 1 1 1 1 1 1 1 1 1 1
symmnumber: 1
zpe: 481294.0 jmol-1
zpe.correction: 0.183315 hartree
zpe.thermalcorrener: 0.193997 hartree
zpe.thermalcorrenthalpy: 0.194941 hartree
zpe.thermalcorrgfe: 0.145309 hartree
zpe.sumelectzpe: -461.697369 hartree
zpe.sumelectthermal: -461.686687 hartree
zpe.sumelectthermalent: -461.685743 hartree
zpe.sumelectthermalfe: -461.735375 hartree
dipole: -0.5131 -0.6572 -1.0620
dipole: 1.3503
quadrupole: -49.9654 -59.5264 -63.3089
quadrupole: 0.4582 1.5430 -3.8089
quadrupole: 7.6348 -1.9262 -5.7087 0.4582 1.5430 -3.8089
hfenergy: -461.8806842 hartree
pointgroup: C01 [X(C8H12O2)]
dipole: -0.1935575 -0.2176377 -0.4442732 debye
dipolederiv: -1.3847932 0.008539 -0.3334598 0.0105947 -0.3729294 -0.1167959 -0.4997884 -0.0939517 -0.5902878 -0.6859857 0.1076529 0.0677313 -0.0690822 -0.5155967 -0.3284366 -0.2362377 -0.2358318 -0.7047562 0.1182965 0.0318519 0.01482 0.0732062 0.0110813 0.0204984 0.1208866 0.0103349 0.1710643 -0.0310885 -0.0589699 0.0069171 -0.0267371 -0.003659 0.0498198 0.0377249 0.0192291 0.1160048 -0.0098151 0.0376751 0.0309443 0.0023924 -0.023996 0.0203235 0.0124259 -0.0109972 0.2300549 -0.2241991 0.108561 0.0112553 0.2430833 -0.0281408 -0.1119942 0.0399765 -0.0772474 0.0650362 0.0273151 -0.0948491 -0.081922 -0.1464978 -0.010426 -0.0285047 -0.1905652 -0.0337085 -0.2019489 -0.0375045 -0.0149808 -0.0622858 0.0212534 0.1641116 -0.0376235 -0.0107055 -0.0053594 -0.2481101 1.533661 -0.1380601 0.2639485 -0.0301795 0.5459018 0.4981931 0.677205 0.3816862 0.9310108 0.5996275 -0.0432361 0.0582415 -0.1168481 0.268457 -0.0463206 -0.0303923 -0.0268551 0.2398908 0.0207939 -0.0206597 0.0516172 0.0059987 0.0545043 -0.0187452 0.0263402 0.0140531 -0.1268815 0.0366775 0.0801266 0.0431732 0.0736003 -0.0614616 -0.0643382 0.0430717 -0.0953615 0.0291912 0.003679 0.0176157 -0.0877416 0.0042085 0.0620478 -0.0065667 -0.1156287 0.0456729 -0.1266242 0.0054842 -0.0302975 -0.074981 -0.0881596 -0.0349188 -0.0713709 -0.1178276 -0.1230171 -0.0517293 0.0278155 -0.0285283 0.0612453 -0.0600431 -0.006687 0.092025 0.1069665 0.1343812 -0.082075 0.0310015 -0.0197082 0.0139446 -0.0554057 -0.0791444 0.0471547 0.0190161 0.068867 0.0839439 0.0491242 0.013679 0.0154858 -0.0153908 0.1051556 0.0220342 -0.02211 -0.0186203 -0.0854974 0.0742261 0.0063074 0.023804 0.0398299 -0.1338518 0.0392524 0.0369234 0.0399268 0.1583482 -0.1095584 0.0902221 0.0454329 0.0897413 0.028565 -0.0033599 0.0599637 -0.0052176 0.1645153 -0.0139966 0.0098934 0.016811 0.027036 0.063844 0.0684628 0.1299562 0.0599321 -0.0695695 -0.0309045 -0.0189184 -0.0833911 -0.0430856 0.0868178 -0.0642629 -0.1241373 -0.0531213 -0.0022572 0.0001437 -0.0439159 -0.0015905 0.0604848 -0.1196746 0.0405555 0.0369361 0.0052057 0.1006766 unknown
polarizability: 115.5347172|2.6930514|81.9358681|-0.7523746|1.4011157|68.2784082 unknown
InChI: InChI=1S/C8H12O2/c1-10-8(9)6-7-4-2-3-5-7/h2,4,7H,3,5-6H2,1H3
charge 0 multiplicity 1
22 atoms
O  -2.677576 -0.39614 -0.728812
O  -1.769369 0.701844 1.112252
C  0.900617 -0.265959 0.406788
C  1.29549 1.133649 -0.174773
C  2.855256 1.136773 -0.271809
C  -0.378654 -0.866029 -0.218693
C  2.148436 -1.105025 0.149687
C  3.21173 -0.343555 -0.217101
C  -1.633363 -0.091555 0.153083
C  -3.973688 0.267276 -0.442164
H  0.724355 -0.179879 1.499839
H  0.901913 1.959978 0.439713
H  0.864167 1.239955 -1.189271
H  3.318074 1.677559 0.579444
H  3.219951 1.630248 -1.192722
H  -0.523758 -1.909446 0.129758
H  -0.299987 -0.917112 -1.319839
H  2.168253 -2.191635 0.295316
H  4.220921 -0.72167 -0.414055
H  -4.334786 -0.014431 0.561365
H  -4.653562 -0.096023 -1.225394
H  -3.860121 1.363375 -0.489714
