program: Gaussian 09
title: 000089227
version: EM64L-G09RevD.01
frameworkgroup: C1[X(C10H13NO)]
method: RPBEPBE
basis: SDD
operation: Freq
keyword: #p
keyword: freq=noraman
keyword: PBEPBE/SDD
title: #p freq=noraman PBEPBE/SDD
converged: YES YES NO NO
title: Mulliken charges:
elementType: O N C C C C C C C C C C H H H H H H H H H H H H H
charge: -0.268484 -0.289591 -0.140579 -0.386327 -0.421971 0.440639 -0.313971 -0.395002 -0.425519 -0.223725 -0.230745 -0.243130 0.194467 0.238028 0.205914 0.181175 0.231236 0.171760 0.227648 0.277336 0.273728 0.226657 0.222813 0.222332 0.225310
chargesum: 0.00000
title: Mulliken charges with hydrogens summed into heavy atoms:
elementType: O N C C C C C C C C C C
charge: -0.268484 -0.012255 0.053888 0.057616 -0.009559 0.440639 0.085436 -0.121275 -0.198862 -0.000911 -0.008413 -0.017820
polarizability: 1.52047426e+02 2.02551251e+00 1.07918745e+02 -3.53258542e+00 1.10979063e+01 7.62225196e+01
1716.lowfreq: -11.7475 0.0001 0.0009 0.0010 3.6433 7.1316 29.4548 81.9055 109.7243
frequency: 28.5113 81.8989 109.7218 221.4212 245.3189 265.7632 296.3641 312.8359 371.6507 402.8245 459.5047 484.4104 523.0381 598.0871 615.9838 670.6557 704.9912 757.1653 804.0371 834.7456 856.4157 887.3141 913.1925 925.5120 955.5285 978.9361 989.6644 996.5906 1008.5063 1026.9085 1033.8001 1069.8008 1082.9017 1103.7097 1151.2393 1170.8597 1183.3075 1184.2007 1208.9127 1217.4215 1261.5698 1289.1850 1310.9314 1317.9616 1331.1441 1344.4529 1384.2662 1388.5718 1427.7385 1438.1574 1440.7406 1460.8616 1470.7520 1484.2128 1593.9662 1616.2485 2808.3768 2848.7492 2894.4028 3001.8254 3051.0759 3076.0758 3082.2633 3109.1624 3124.1617 3137.9937 3155.9471 3170.7632 3526.8729
redmass: 3.5978 4.1897 3.9812 3.4354 1.8682 3.4553 1.7476 3.3813 1.9758 2.8409 3.7282 2.8280 3.2921 4.4838 6.4103 3.3352 1.8348 1.8202 3.0843 2.7464 1.2508 2.6222 2.5958 1.4264 3.1406 1.3714 6.1821 1.3431 3.8009 2.1161 2.3700 1.9738 1.6029 1.9893 2.1920 1.0546 1.1108 1.3017 1.5366 1.4737 1.4433 1.2000 1.3232 1.2272 1.3066 1.5935 3.1625 1.7094 1.3529 2.1071 1.1123 1.0927 1.1043 2.3917 6.2111 6.1376 1.0705 1.0709 1.0820 1.0607 1.0892 1.1024 1.0912 1.0873 1.0867 1.0929 1.0978 1.0971 1.0768
irintensity: 1.0503 2.0881 1.9021 2.2939 37.7714 25.2856 114.3849 3.5969 4.4690 0.2224 5.1909 8.3063 8.0474 11.8702 0.0820 8.4107 48.4919 59.4783 11.9504 4.0412 0.0876 16.3124 4.6675 1.2065 35.6921 0.3045 0.0567 5.6617 145.9350 1.7320 9.6077 2.7386 6.4004 3.6388 29.4642 0.2050 1.8134 2.7160 3.4936 13.3212 0.8350 1.5062 10.1630 23.9971 17.9800 14.1286 8.2189 8.2310 20.2924 6.7922 5.0170 0.8737 11.3235 14.7515 1.2623 6.9145 138.5750 114.6238 68.4655 23.7088 40.7316 25.9439 34.8294 11.2900 1.3731 34.9348 32.2178 8.6095 1.2860
temp: 298.150 k
press: 1.00000 atm
elementType: 8 7 6 6 6 6 6 6 6 6 6 6 1 1 1 1 1 1 1 1 1 1 1 1 1
symmnumber: 1
zpe: 551969.4 jmol-1
zpe.correction: 0.210234 hartree
zpe.thermalcorrener: 0.220668 hartree
zpe.thermalcorrenthalpy: 0.221613 hartree
zpe.thermalcorrgfe: 0.173500 hartree
zpe.sumelectzpe: -517.913993 hartree
zpe.sumelectthermal: -517.903558 hartree
zpe.sumelectthermalent: -517.902614 hartree
zpe.sumelectthermalfe: -517.950727 hartree
dipole: -2.0630 1.8000 0.2871
dipole: 2.7529
quadrupole: -56.4326 -68.8313 -74.2164
quadrupole: -0.5797 -2.2893 2.3870
quadrupole: 10.0608 -2.3378 -7.7229 -0.5797 -2.2893 2.3870
hfenergy: -518.1242268 hartree
pointgroup: C01 [X(C10H13N1O1)]
dipole: 0.8054018 -0.7136583 0.1228917 debye
dipolederiv: -1.0744259 -0.1202332 -0.0160213 -0.2355877 -0.4977673 -0.1025743 -0.1235447 -0.0922963 -0.4850844 -0.434813 -0.0065436 0.0002777 0.0226955 -0.6205353 0.0257995 0.2034557 0.0131422 -0.7667303 0.4650627 0.1195888 0.0299559 0.4303448 0.4526229 0.0630889 0.0944296 0.0231088 0.4270292 -0.1512099 0.0329339 0.019081 -0.0716199 0.030684 -0.067775 -0.0775487 -0.049202 0.0056266 0.1758994 0.1450991 0.0772644 0.0929105 0.5183531 -0.0941111 0.1444691 -0.1026891 0.3239906 0.283223 -0.0490887 -0.0016936 -0.0909851 -0.0575272 -0.0258476 0.0228529 -0.0195746 -0.0598728 1.0488594 -0.0611269 -0.1024044 -0.1887704 0.4252591 0.0430805 -0.0639492 0.0818402 0.8438509 -0.1304355 0.0759181 -0.0070969 0.1251649 -0.023087 -0.0427752 0.0003021 -0.0281799 -0.1140946 -0.1465783 -0.0180135 0.0350497 -0.0350065 0.0195792 -0.0887542 0.0150818 -0.0863495 -0.1204406 -0.0040674 -0.0518282 0.0457686 -0.0608984 0.0744529 -0.1081569 0.0348858 -0.1058228 -0.0980582 0.0188469 0.0674281 -0.0134025 0.0875138 0.03109 -0.0775997 -0.0187795 -0.0765746 -0.1151188 0.0529426 -0.0023229 0.0413143 -0.0159463 -0.0967434 -0.0414634 0.0388298 -0.0370678 -0.1508477 -0.0298611 0.0140173 -0.0644961 -0.0318181 -0.0777367 0.0791487 -0.0243084 0.0862999 -0.147571 0.0462906 0.0389684 -0.0332057 0.0396876 0.0415207 0.1007644 -0.0398511 0.0367752 -0.0718628 0.0320081 -0.094183 -0.0043145 -0.1160657 -0.1214209 -0.0364319 -0.0187172 0.0096641 0.0752339 0.0020504 -0.0220863 -0.0422798 0.0152987 -0.1473488 0.0782488 -0.0906447 0.2207026 -0.1489285 -0.0356451 0.0632003 0.0906455 0.04347 -0.004884 -0.0769305 0.1117597 -0.1029802 -0.0569373 -0.0915214 0.0174821 0.0316972 0.089113 -0.0134561 0.1933126 -0.0584214 0.0109632 -0.2904049 -0.0244191 -0.086578 -0.028101 -0.1043228 -0.1112887 -0.0562225 0.0160109 -0.016143 0.0609191 -0.0298451 -0.0445014 0.0337044 0.0461712 0.1613325 -0.1116591 -0.0894088 -0.1041117 0.3008114 0.096359 -0.0773838 0.0249686 -0.085116 0.0355591 0.0475289 0.0434167 0.0399488 0.131061 0.058463 0.0823343 -0.0587969 0.0669097 -0.0387775 0.0920061 -0.0525021 0.0939454 0.0887415 0.0369525 0.0610257 -0.0409003 0.0775384 -0.055978 0.1036506 -0.0538508 0.102056 0.1008707 -0.0198317 -0.100678 0.0282197 -0.1169445 -0.0224517 0.0721305 0.0322631 0.0719847 0.1258534 -0.1443041 0.0165713 -0.0452338 0.0162631 0.0985491 0.0315416 -0.0462305 0.0305606 0.1419638 unknown
polarizability: 151.97387|1.8673426|107.8987083|4.4095222|-11.0914252|76.3161123 unknown
InChI: InChI=1S/C10H13NO/c1-2-4-9(5-3-1)10-6-7-11-8-12-10/h1-5,10-11H,6-8H2
charge 0 multiplicity 1
25 atoms
O  1.374702 1.083871 0.516036
N  3.457546 0.236573 -0.343763
C  0.755823 -0.257993 0.429628
C  1.429319 -1.076748 -0.708834
C  2.959623 -1.14207 -0.489567
C  -0.737748 -0.084325 0.214521
C  2.819965 0.952308 0.752613
C  -1.256443 1.083528 -0.396161
C  -1.626736 -1.123906 0.585688
C  -2.644322 1.205518 -0.633949
C  -3.013419 -1.004546 0.343598
C  -3.527038 0.162267 -0.269365
H  0.938286 -0.78866 1.395314
H  1.218549 -0.577884 -1.671464
H  0.995935 -2.094645 -0.737722
H  3.170989 -1.770327 0.414448
H  3.447617 -1.624082 -1.354561
H  2.94078 0.427189 1.739008
H  3.214098 1.978228 0.824435
H  4.464246 0.382012 -0.450462
H  -0.565457 1.889468 -0.660141
H  -1.236127 -2.026827 1.073123
H  -3.037799 2.115495 -1.101586
H  -3.69132 -1.81384 0.638252
H  -4.60297 0.259095 -0.454292
