program: Gaussian 09
title: 000089209
version: EM64L-G09RevD.01
frameworkgroup: C1[X(C5H13NO2)]
method: RPBEPBE
basis: SDD
operation: Freq
keyword: #p
keyword: freq=noraman
keyword: PBEPBE/SDD
title: #p freq=noraman PBEPBE/SDD
converged: YES YES NO NO
title: Mulliken charges:
elementType: O O N C C C C C H H H H H H H H H H H H H
charge: -0.468473 -0.485440 -0.311252 -0.046501 -0.396603 -0.342690 -0.311949 -0.689512 0.193707 0.223115 0.212627 0.241594 0.200246 0.224907 0.183152 0.211190 0.229242 0.203520 0.213311 0.361411 0.354399
chargesum: 0.00000
title: Mulliken charges with hydrogens summed into heavy atoms:
elementType: O O N C C C C C
charge: -0.107062 -0.131041 -0.069658 0.147206 0.039138 0.082463 0.082392 -0.043439
polarizability: 8.58708761e+01 2.41133226e-01 6.57304140e+01 1.27475509e-01 4.01461934e-03 5.79833946e+01
1716.lowfreq: -9.7793 -0.0009 -0.0008 -0.0003 0.3195 13.2992 56.1114 75.2228 82.9349
frequency: 56.0072 75.1917 82.9340 139.8219 142.9113 235.9466 246.7583 253.6456 285.5452 326.2197 427.1037 495.1102 503.2325 538.5570 701.1749 810.2064 835.8965 892.6202 918.8593 969.2782 1023.2344 1050.0276 1055.1089 1069.7950 1114.3175 1127.7482 1152.7528 1173.6477 1206.4778 1238.0639 1262.7420 1270.4649 1313.0624 1333.5670 1362.2985 1386.6702 1393.9940 1412.2715 1448.3373 1462.6765 1471.5941 1479.8381 1486.2158 1499.7600 2861.6079 2900.8069 2929.1905 2966.9925 2978.4561 3002.2058 3022.7679 3049.2320 3070.9428 3091.7086 3411.4215 3521.3355 3597.7929
redmass: 3.0484 1.8180 3.2579 2.8536 3.2556 1.6920 1.1629 1.4790 3.7963 4.6518 2.1955 1.1449 2.9880 3.4969 1.3445 1.1064 2.4112 1.8615 1.6397 5.3978 2.7779 2.4050 1.6959 1.8519 1.9857 1.3927 2.4586 1.2197 1.5635 1.2649 1.1715 1.1722 1.2113 1.2808 1.3371 1.2886 1.3905 1.8140 1.1774 1.0816 1.0586 1.0572 1.0802 1.0851 1.0720 1.0698 1.0826 1.0590 1.0373 1.0869 1.0907 1.1043 1.0979 1.1002 1.0737 1.0649 1.0669
irintensity: 3.4010 4.3800 1.9889 6.1915 4.9374 13.1110 61.3563 80.1759 3.2478 9.6974 3.9762 169.4347 2.6148 26.3753 107.6436 4.7236 5.8195 1.4342 17.2393 96.3158 54.1200 51.4469 9.0824 10.4307 12.7649 11.2618 35.3185 16.6254 10.7859 15.8223 35.6179 1.1977 8.2643 13.7696 10.4678 12.4474 13.8443 13.0507 25.9385 7.1848 17.4579 7.1782 2.0817 5.8896 110.2120 93.2906 43.6063 51.0309 29.5021 27.2964 38.8348 52.7682 56.6976 39.5891 2.4375 18.1051 5.7458
temp: 298.150 k
press: 1.00000 atm
elementType: 8 8 7 6 6 6 6 6 1 1 1 1 1 1 1 1 1 1 1 1 1
symmnumber: 1
zpe: 479320.6 jmol-1
zpe.correction: 0.182564 hartree
zpe.thermalcorrener: 0.193074 hartree
zpe.thermalcorrenthalpy: 0.194018 hartree
zpe.thermalcorrgfe: 0.146368 hartree
zpe.sumelectzpe: -402.805218 hartree
zpe.sumelectthermal: -402.794707 hartree
zpe.sumelectthermalent: -402.793763 hartree
zpe.sumelectthermalfe: -402.841414 hartree
dipole: 1.0139 -2.1479 0.4355
dipole: 2.4148
quadrupole: -46.7389 -51.9070 -48.6118
quadrupole: 7.7561 -3.6469 -2.2416
quadrupole: 2.3470 -2.8211 0.4741 7.7561 -3.6469 -2.2416
hfenergy: -402.9877811 hartree
pointgroup: C01 [X(C5H13N1O2)]
dipole: 0.4026273 0.8325685 -0.2175456 debye
dipolederiv: -0.6630029 -0.2753163 -0.058527 -0.2776797 -0.5589974 0.0795094 -0.0614717 0.091098 -0.5558309 -0.8687126 0.1486191 0.0201645 0.1485974 -0.4342071 -0.2183883 0.0518602 -0.2312099 -0.4079074 -0.8240874 -0.0108844 0.0442752 0.031784 -0.6122179 0.0015867 0.0421505 0.0135807 -0.1329892 0.5114373 0.1640517 0.0834422 0.2016773 0.361101 0.0249509 0.0490016 0.0285958 0.4187033 0.3231469 0.1238608 0.0491298 0.1749971 0.3897452 -0.0589018 0.1856833 -0.0103676 0.2088128 0.5854843 -0.1168865 -0.07402 -0.2053325 0.1780861 0.1514608 -0.0306296 0.1645827 0.2714295 0.590965 -0.1365304 -0.0802418 -0.1560298 0.3466606 -0.0490534 -0.2221008 -0.0612801 0.2640861 -0.0947763 -0.0715601 -0.0040624 -0.0628042 0.0030266 -0.0241341 -0.0139191 -0.0099978 0.0945931 -0.0082447 -0.0455365 -0.023343 -0.0298095 -0.0261326 -0.0576002 -0.0598226 -0.0718165 -0.2199591 -0.0327904 0.0440019 -0.0315228 -0.0608869 -0.2285976 0.0766134 -0.0189366 0.1133734 0.0225192 0.0543546 -0.0111084 0.0165306 -0.0295671 0.0569666 -0.0032918 -0.002434 -0.0510431 -0.1560786 0.1293502 -0.0454069 -0.0091307 -0.0430898 0.2576392 0.0306361 0.0063384 -0.0611562 -0.0554015 -0.0228114 0.0381424 0.0124555 0.0289306 0.0534902 -0.0719931 0.042814 -0.0346392 -0.1943983 -0.0381501 -0.0821546 0.0130916 -0.1416293 -0.0705773 -0.0300001 -0.0005868 -0.0574605 0.0600451 -0.1233714 0.0522431 0.0094933 0.1799894 -0.2606864 0.040383 -0.0072632 0.0882068 0.0281251 0.0134306 -0.0095301 -0.0536899 0.0158132 0.0569308 -0.0167838 0.0156474 -0.0293829 -0.1901983 0.0971421 0.0774779 -0.0317175 0.0103973 -0.1362329 0.0584537 -0.025815 0.0665332 0.0665875 0.0884273 -0.0093521 0.008363 -0.0282705 0.0742999 0.0097076 -0.0503418 -0.0262039 -0.1925735 -0.1667091 0.0239254 0.0774227 0.0569155 0.0784992 -0.0355267 0.1000216 -0.0279554 0.0623644 0.1639847 0.1001717 0.0176154 0.1054689 0.3168026 -0.0724471 0.0215923 -0.0746686 0.3574704 0.2849332 0.0417724 0.0142712 0.0805284 0.1544013 0.1648188 -0.021788 0.1812112 0.2506007 unknown
polarizability: 85.868751|-0.330307|65.7092837|-0.0786154|-0.4261378|58.00665 unknown
InChI: InChI=1S/C5H13NO2/c1-2-6-3-5(8)4-7/h5-8H,2-4H2,1H3
charge 0 multiplicity 1
21 atoms
O  -2.136907 -1.414595 0.121239
O  -2.937643 1.21713 0.088247
N  1.288942 0.060773 0.247832
C  -1.157109 -0.34718 0.360176
C  0.206338 -0.892877 -0.086293
C  -1.570978 0.918122 -0.398775
C  2.619725 -0.312054 -0.285663
C  3.688493 0.706164 0.1460
H  -1.128492 -0.102054 1.447053
H  0.335713 -1.902464 0.37181
H  0.194252 -1.040938 -1.183374
H  1.338452 0.223389 1.265166
H  -1.582944 0.710996 -1.489299
H  -0.866811 1.742534 -0.179905
H  2.934855 -1.338997 0.029764
H  2.54864 -0.33092 -1.390946
H  3.41639 1.719565 -0.197781
H  3.791508 0.733906 1.248128
H  4.67495 0.442607 -0.276115
H  -3.032526 -0.992138 0.209654
H  -3.311647 1.990331 -0.400016
