program: Gaussian 09
title: 000089193
version: EM64L-G09RevD.01
frameworkgroup: C1[X(C9H14O2)]
method: RPBEPBE
basis: SDD
operation: Freq
keyword: #pfreq=noraman
keyword: PBEPBE/SDD
title: #p freq=noraman PBEPBE/SDD
converged: YES YES NO NO
title: Mulliken charges:
elementType: O O C C C C C C C C C H H H H H H H H H H H H H H
charge: -0.450540 -0.206377 0.228880 -0.507423 -0.129982 0.042670 -0.732958 -0.737863 0.301374 -0.328869 -0.783733 0.197434 0.237733 0.219048 0.249507 0.206137 0.217629 0.221448 0.218623 0.240316 0.254692 0.214779 0.246648 0.241331 0.339496
chargesum: 0.00000
title: Mulliken charges with hydrogens summed into heavy atoms:
elementType: O O C C C C C C C C C
charge: -0.111044 -0.206377 0.228880 -0.072256 0.089066 0.042670 -0.059685 -0.057477 0.301374 -0.074178 -0.080975
polarizability: 1.19152456e+02 5.46092799e+00 1.06244759e+02 -3.21626778e+00 -7.72764935e-01 7.58338154e+01
1716.lowfreq: -17.5482 -9.5748 -0.0009 -0.0009 -0.0009 12.8444 53.7608 128.4497 132.0050
frequency: 53.5450 128.4058 131.9977 167.9152 196.0038 223.4851 240.1748 265.3318 274.6389 286.1286 307.5784 336.0209 362.7927 392.8853 408.5674 443.7041 506.2686 564.4502 586.5062 710.2262 755.8476 829.3088 862.6498 897.1307 926.4771 942.3723 950.0640 977.4998 998.7662 1029.4857 1038.1196 1051.7589 1088.8873 1138.5374 1173.3545 1194.2247 1204.3782 1225.5206 1265.9254 1290.4734 1338.4260 1348.0756 1373.9485 1380.6373 1393.6582 1399.4632 1450.2647 1454.7916 1463.9410 1468.3703 1471.3378 1475.3398 1491.7326 1572.9976 1657.5937 2911.2498 2972.6317 2976.4198 2983.5989 2989.0666 3040.6055 3070.6634 3071.1168 3076.1874 3083.8497 3097.9334 3100.7531 3121.5254 3559.1338
redmass: 5.1779 2.7936 1.1537 2.3601 1.4719 1.7213 1.2241 1.3989 2.1171 1.8468 2.7168 3.1335 4.0551 3.0893 5.3013 3.5704 3.3706 3.3122 2.4658 4.3860 4.3452 2.8940 1.5996 2.1147 2.4660 1.5813 2.0953 2.0751 1.7091 1.5941 1.9025 1.5391 1.5682 1.9558 2.3167 1.2681 2.3375 2.4729 1.6758 1.3146 1.5145 2.5022 1.2165 1.6906 1.2476 1.2425 1.0451 1.0628 1.0741 1.0718 1.0550 1.0561 1.0701 9.5583 7.3744 1.0808 1.0585 1.0365 1.0371 1.0361 1.1008 1.0993 1.0974 1.0996 1.1000 1.1012 1.0987 1.0917 1.0661
irintensity: 3.8726 1.7414 1.1490 1.8296 1.6285 1.7806 1.5079 78.9782 7.9423 60.5360 3.8704 1.5290 16.1562 1.5730 1.3093 0.3567 9.5023 2.0663 1.6014 3.0642 2.5419 1.5017 7.1954 1.4888 36.0745 9.6991 22.4664 36.4744 40.3181 0.1935 38.2336 6.3911 1.4307 27.4292 18.4887 50.6977 4.5752 15.9905 2.4111 2.8873 24.4031 13.9676 18.5480 1.0573 28.4648 22.6649 12.7482 0.7422 7.5208 12.5949 9.2278 9.7299 15.6817 147.7108 11.1383 40.3279 32.7810 27.9686 40.9707 16.1755 22.6838 11.1695 25.2922 46.8419 15.3837 14.1457 19.1663 13.2214 4.8628
temp: 298.150 k
press: 1.00000 atm
elementType: 8 8 6 6 6 6 6 6 6 6 6 1 1 1 1 1 1 1 1 1 1 1 1 1 1
symmnumber: 1
zpe: 551614.4 jmol-1
zpe.correction: 0.210099 hartree
zpe.thermalcorrener: 0.222200 hartree
zpe.thermalcorrenthalpy: 0.223145 hartree
zpe.thermalcorrgfe: 0.173104 hartree
zpe.sumelectzpe: -500.925363 hartree
zpe.sumelectthermal: -500.913261 hartree
zpe.sumelectthermalent: -500.912317 hartree
zpe.sumelectthermalfe: -500.962358 hartree
dipole: -1.9760 -2.3157 1.3618
dipole: 3.3349
quadrupole: -76.8306 -59.8053 -66.9154
quadrupole: 0.8254 -1.1458 0.5008
quadrupole: -8.9801 8.0451 0.9350 0.8254 -1.1458 0.5008
hfenergy: -501.1354616 hartree
pointgroup: C01 [X(C9H14O2)]
dipole: 0.7606383 -0.9272754 -0.5320346 debye
dipolederiv: -0.93335 0.0637272 -0.0291311 0.0530506 -0.187767 0.1133278 -0.0982274 0.1376349 -0.528768 -0.9248826 0.1379038 0.1162577 0.1312368 -0.6125128 -0.0395042 0.0895221 -0.0262127 -0.3168542 0.0613057 0.0251074 0.0265807 0.032245 -0.2301418 -0.0656844 0.0257459 -0.1045943 0.0669748 -0.1767184 -0.0447569 0.0067387 -0.1084046 0.1209614 0.0392927 0.0245711 0.0268342 0.0143961 0.702414 -0.1297793 0.0890667 -0.1165967 0.2117048 -0.0353095 0.1972668 -0.1050332 0.4593757 1.0922941 -0.0644584 -0.1638519 0.2185709 0.8236557 0.0958709 -0.1350711 0.0734015 0.1006159 -0.0395145 -0.0051815 0.0220695 -0.0435553 0.0334199 0.038903 0.0112684 0.0197382 0.0235421 0.0284027 0.0227661 -0.0027175 -0.0250096 0.0054177 -0.0201972 -0.0049517 0.0629295 -0.0254514 -0.4942073 -0.1791321 0.0460517 -0.3113987 0.1658662 0.0343746 0.0342878 0.0501897 -0.0540138 0.17426 0.1345219 -0.0616215 -0.0633383 -0.0003179 0.0238847 -0.1166064 0.0242063 -0.1655297 0.0061399 0.0952371 0.0074952 0.0721057 -0.1679756 -0.0122415 0.0215602 -0.0183776 0.060985 0.0478345 0.0506108 -0.0003628 0.0681417 -0.2077668 -0.0078771 0.028163 -0.048722 0.0739555 0.0518206 -0.0089665 -0.014577 -0.0143004 0.0749713 -0.0428663 -0.0225188 -0.0058817 -0.1247981 -0.0401729 0.0493519 0.0021973 0.077383 -0.0442618 -0.0648861 -0.0399953 -0.0246167 -0.1792025 -0.0881858 0.0006612 -0.0305245 0.0774895 0.1115256 0.0114986 -0.0611803 0.0157059 0.0782971 0.0817087 0.046616 0.0204257 -0.0193947 -0.1742992 -0.013855 0.0191942 -0.0532067 0.0717605 0.0754289 -0.0175689 -0.0516093 -0.0120934 0.0779501 -0.0531609 -0.0098477 -0.0101574 -0.1564992 -0.0032884 -0.0723261 0.1218161 -0.073368 0.0220362 0.0843541 0.0807214 0.0749857 -0.0125754 0.0825434 0.0561167 0.0057953 0.0255872 -0.1571065 -0.061752 -0.0153994 -0.0326148 0.0529192 -0.1063878 0.0072103 -0.0987556 0.049065 0.091599 0.0047245 -0.0273601 -0.0032749 0.064401 0.0199219 -0.0969179 0.0231354 -0.0880328 -0.0246898 0.0213036 0.041526 -0.0104765 0.1255255 -0.073982 -0.1563673 0.0210995 -0.0529702 -0.0070747 0.0055002 0.0219285 0.0196211 0.1016134 0.0799276 0.0345441 0.0830074 0.0258367 0.0498822 -0.0134473 0.0708584 -0.0660542 -0.0475568 0.0295383 0.0530002 -0.1053688 0.0248728 0.0453714 0.0112366 -0.0966767 0.0625185 -0.0080302 0.3471493 -0.0019199 -0.0332168 0.0728779 -0.0204476 -0.0534897 -0.0387788 -0.0585426 0.3249173 unknown
polarizability: 118.9464834|-5.7336865|106.4821003|-2.9793029|0.8165111|75.8024471 unknown
InChI: InChI=1S/C9H14O2/c1-6-4-7(10)5-9(2,3)8(6)11/h4,7,10H,5H2,1-3H3
charge 0 multiplicity 1
25 atoms
O  3.064209 -0.64677 0.378872
O  -2.202901 0.950526 0.260063
C  -0.775569 -1.026949 -0.038318
C  0.666976 -1.363122 0.437435
C  1.739555 -0.513245 -0.266349
C  -1.031034 0.497162 0.089281
C  -1.805977 -1.807854 0.810328
C  -0.970996 -1.389386 -1.545173
C  0.126948 1.438274 -0.051676
C  1.396483 0.954411 -0.215602
C  -0.190937 2.917111 -0.007657
H  0.859986 -2.443391 0.273452
H  0.751288 -1.170254 1.524699
H  1.828686 -0.825347 -1.333055
H  -2.832343 -1.502609 0.547143
H  -1.699683 -2.894848 0.636798
H  -1.664002 -1.613042 1.889137
H  -0.313402 -0.801796 -2.211529
H  -0.756365 -2.462603 -1.704819
H  -2.01604 -1.196218 -1.845408
H  2.246905 1.639894 -0.32902
H  0.721148 3.527944 -0.115528
H  -0.686788 3.17779 0.944688
H  -0.904508 3.189452 -0.806344
H  3.347661 -1.595028 0.326182
