program: Gaussian 09
title: 000089194
version: EM64L-G09RevD.01
frameworkgroup: C1[X(C13H15NO3)]
method: RPBEPBE
basis: SDD
operation: Freq
keyword: #p
keyword: freq=noraman
keyword: PBEPBE/SDD
title: #p freq=noraman PBEPBE/SDD
converged: YES YES NO NO
title: Mulliken charges:
elementType: O O O N C C C C C C C C C C C C C H H H H H H H H H H H H H H H
charge: -0.239297 -0.319336 -0.273720 -0.282421 -0.119280 0.254009 0.349633 -0.183951 -0.317107 -0.324738 -0.398477 0.289407 -0.240041 -0.261113 -0.524025 -0.204800 -0.678728 0.235686 0.222875 0.235575 0.294825 0.229322 0.227269 0.228466 0.204934 0.224593 0.238497 0.233120 0.228989 0.217339 0.226866 0.225629
chargesum: 0.00000
title: Mulliken charges with hydrogens summed into heavy atoms:
elementType: O O O N C C C C C C C C C C C C C
charge: -0.239297 -0.319336 -0.273720 -0.282421 0.116406 0.254009 0.349633 0.038924 -0.081531 -0.029913 -0.169155 0.289407 -0.012772 -0.032647 0.143999 0.257309 -0.008894
polarizability: 2.28181724e+02 1.63520178e+01 1.68667881e+02 -4.56532437e-01 -1.75841366e+01 9.55428024e+01
1716.lowfreq: -6.3805 -2.8910 0.0004 0.0004 0.0005 4.9759 25.2678 33.4849 48.2210
frequency: 24.8973 33.3990 48.2137 70.4686 81.9266 104.7095 113.6484 148.9835 183.2089 214.9235 238.5102 253.9866 268.4977 308.8722 331.5639 378.8978 389.9388 407.9117 441.0627 472.6102 507.1892 534.6952 582.0630 599.9025 644.3121 699.2695 717.9223 735.7744 760.5401 783.1085 797.8661 801.2851 808.0339 852.6795 873.5598 884.0092 948.7271 971.4400 974.0582 985.4474 997.4979 1011.1482 1037.2845 1048.4989 1098.6791 1105.7001 1108.8534 1122.9274 1137.6316 1145.3351 1175.7585 1188.7165 1201.7794 1233.9422 1249.2156 1270.8144 1297.1588 1326.1908 1362.8893 1375.9380 1392.3099 1398.9846 1399.8517 1428.7773 1449.1183 1463.2574 1464.7708 1472.5555 1475.3663 1487.9929 1490.4077 1577.0925 1610.0041 1632.4392 1660.9488 2940.7659 2994.1486 3013.9090 3023.7821 3047.5368 3072.0613 3091.2665 3100.4622 3105.4432 3122.9918 3126.3115 3138.7898 3160.8888 3162.8513 3210.7886
redmass: 2.8043 2.9367 3.6535 2.8767 5.8457 3.7712 2.9544 1.9145 1.8316 4.2013 4.3875 1.2664 3.9046 3.3391 5.0587 6.7561 3.7259 3.3047 5.6184 4.2692 4.7967 4.9533 3.8710 5.9624 6.5138 6.5602 2.4095 6.9833 1.4792 2.5180 2.3753 1.2612 4.0127 3.9498 1.5407 3.5478 1.3659 4.2517 1.3650 1.3307 11.0328 3.3098 3.1704 2.2509 2.9982 1.2515 2.2339 1.7580 1.4626 1.3770 1.1860 1.2879 2.3912 1.9375 1.1317 2.7994 1.6560 1.2379 1.4113 1.7292 4.6725 1.2861 1.8581 1.1380 2.3861 1.0475 1.0495 1.0512 1.0559 1.1414 2.4386 6.8975 6.3095 11.1514 7.0703 1.0329 1.0357 1.0584 1.1018 1.0861 1.1060 1.0985 1.0989 1.1034 1.0875 1.0870 1.0902 1.0988 1.0989 1.0936
irintensity: 4.6084 0.4767 1.3087 3.2589 0.2766 1.1981 3.2998 0.7255 3.0802 1.6669 0.8516 0.9474 8.0939 3.2909 8.4904 5.0530 5.4087 7.6063 2.4668 9.5982 2.2304 4.9837 1.8653 6.9654 5.1224 4.9832 3.3328 4.4189 55.5414 8.9992 13.0115 12.1855 25.8430 135.3494 9.1985 13.4430 4.8768 62.6481 6.7904 0.3840 150.8005 2.2119 202.0456 2.6499 105.3839 0.6681 10.5645 23.6102 5.0842 5.2172 15.8654 2.7233 304.7141 47.0759 0.0322 310.2102 17.6941 57.6184 23.3314 24.3429 1.1559 26.2135 34.9747 0.9830 18.2495 14.8595 7.1307 5.4327 11.2303 17.6402 66.2712 4.7630 30.2039 255.0805 19.7593 101.3630 20.1648 23.7333 51.0007 10.6303 3.1332 34.2817 23.4982 48.6335 1.4351 11.0655 16.7630 24.1668 29.6802 4.2531
temp: 298.150 k
press: 1.00000 atm
elementType: 8 8 8 7 6 6 6 6 6 6 6 6 6 6 6 6 6 1 1 1 1 1 1 1 1 1 1 1 1 1 1 1
symmnumber: 1
zpe: 671044.9 jmol-1
zpe.correction: 0.255588 hartree
zpe.thermalcorrener: 0.271932 hartree
zpe.thermalcorrenthalpy: 0.272876 hartree
zpe.thermalcorrgfe: 0.210077 hartree
zpe.sumelectzpe: -783.536622 hartree
zpe.sumelectthermal: -783.520277 hartree
zpe.sumelectthermalent: -783.519333 hartree
zpe.sumelectthermalfe: -783.582133 hartree
dipole: 2.5191 1.9776 -1.0899
dipole: 3.3830
quadrupole: -77.7461 -96.4528 -102.5043
quadrupole: 0.3977 0.5256 -5.1760
quadrupole: 14.4883 -4.2184 -10.2699 0.3977 0.5256 -5.1760
hfenergy: -783.7922092 hartree
pointgroup: C01 [X(C13H15N1O3)]
dipole: 0.9529799 0.8133819 -0.4491423 debye
polarizability: 226.2943856|19.5733123|169.2110953|0.9678604|-20.013183|96.8869263 unknown
InChI: InChI=1S/C13H15NO3/c1-3-17-13(15)14-11-7-5-4-6-10(11)8-9-12(14)16-2/h4-9,12H,3H2,1-2H3
charge 0 multiplicity 1
32 atoms
O  0.800055 1.947663 1.050752
O  2.464744 -0.35007 -0.233821
O  1.083022 -2.2106 0.009268
N  0.170983 -0.019025 -0.185171
C  0.547996 1.405038 -0.320706
C  -1.211374 -0.392066 -0.014578
C  -2.212346 0.533847 -0.456545
C  -0.516785 2.22558 -0.988927
C  -1.815372 1.818367 -1.022619
C  -1.613989 -1.623911 0.561791
C  -3.583619 0.19086 -0.329527
C  1.20651 -0.967571 -0.116807
C  -2.984965 -1.9350 0.683179
C  -3.979758 -1.034834 0.235193
C  2.032268 2.738337 1.148719
C  3.621633 -1.294418 -0.220403
C  4.883309 -0.442024 -0.310315
H  1.496995 1.448758 -0.881653
H  -0.202351 3.195323 -1.387522
H  -2.592863 2.456203 -1.459279
H  -0.864624 -2.342577 0.891148
H  -4.335611 0.909817 -0.676777
H  -3.272188 -2.892094 1.13231
H  -5.041135 -1.286637 0.329234
H  1.961914 3.689679 0.581797
H  2.90695 2.158092 0.792057
H  2.152073 2.969866 2.219279
H  3.575446 -1.886437 0.71073
H  3.517244 -1.987301 -1.074634
H  5.772977 -1.097734 -0.309966
H  4.894919 0.155217 -1.238357
H  4.960339 0.243251 0.551548
