program: Gaussian 09
title: 000089173
version: EM64L-G09RevD.01
frameworkgroup: C1[X(C9H18NO2)]
method: RPBEPBE
basis: SDD
operation: Freq
keyword: #p
keyword: freq=noraman
keyword: PBEPBE/SDD
title: #p freq=noraman PBEPBE/SDD
converged: YES YES NO NO
title: Mulliken charges:
elementType: O O N C C C C C C C C C H H H H H H H H H H H H H H H H H H
charge: -0.247221 -0.228949 -0.087277 -0.355196 -0.356027 -0.424159 -0.435093 -0.388182 -0.606517 -0.517595 0.247473 -0.491602 0.277055 0.272363 0.279393 0.277414 0.248274 0.280879 0.241086 0.285877 0.311477 0.279763 0.283296 0.272909 0.272186 0.254703 0.286506 0.256582 0.254916 0.255669
chargesum: 1.00000
title: Mulliken charges with hydrogens summed into heavy atoms:
elementType: O O N C C C C C C C C C
charge: -0.247221 -0.228949 -0.087277 0.194221 0.200780 0.104994 0.091870 0.203057 0.221873 0.023614 0.247473 0.275565
polarizability: 1.30651512e+02 -3.27519167e+00 9.53536522e+01 -2.10864976e+00 1.88941940e+00 8.70137196e+01
1716.lowfreq: -26.5096 -8.3906 -5.2602 0.0004 0.0006 0.0007 22.7839 31.0830 47.7337
frequency: 20.3833 30.4858 47.2086 67.5574 94.4865 148.4125 182.8266 220.4714 234.4463 260.6092 292.7351 316.5646 345.0327 388.0607 440.2848 467.5924 553.7958 571.5271 589.7204 666.3987 711.4594 786.3685 816.2965 829.4911 837.3910 896.7984 917.7069 921.6929 927.4687 943.8158 989.7332 995.2561 1050.4016 1065.7270 1077.4861 1103.2613 1114.6855 1146.2880 1150.3732 1154.9678 1169.3758 1182.6808 1224.1875 1225.8649 1250.5817 1261.6805 1300.4334 1309.5508 1324.6900 1326.9758 1335.3276 1341.5357 1387.8262 1425.3865 1434.4348 1454.6398 1455.1001 1458.9083 1466.6599 1472.9295 1473.6128 1476.1328 1482.5471 1484.8322 1492.9999 1638.8183 3000.6770 3019.9835 3021.2730 3023.2863 3025.2357 3031.6503 3043.2075 3050.6218 3081.1320 3099.1053 3100.3167 3105.3141 3123.4065 3129.7855 3129.9575 3138.5819 3145.1566 3172.3553
redmass: 3.0935 4.4066 2.4385 1.1306 3.1262 2.9914 2.8085 2.7201 3.5919 2.4197 1.0581 3.6897 2.0185 2.6392 2.2907 3.0662 1.9593 3.3120 3.7268 3.6862 2.8353 2.3174 1.5719 2.7739 2.1511 1.7566 3.2915 2.6103 2.3123 3.7947 2.1440 2.1978 1.6970 1.8498 2.4978 1.5401 1.2639 1.5166 1.4296 1.4798 1.6264 2.9938 1.4605 1.3463 1.3556 1.2585 1.5515 1.3493 1.2345 1.2501 1.3496 1.3615 1.3629 1.1912 1.1545 1.0854 1.0531 1.0506 1.0706 1.0693 1.0788 1.0815 1.0704 1.0631 1.0846 8.3477 1.0658 1.0300 1.0579 1.0338 1.0661 1.0624 1.0601 1.0612 1.1008 1.1003 1.1028 1.1034 1.1088 1.1088 1.1060 1.1055 1.1049 1.1060
irintensity: 0.4821 1.7905 0.4760 0.5720 0.9904 4.2794 7.0370 5.2910 6.9520 10.2024 0.1842 13.4075 0.2059 2.0708 0.1881 0.6430 3.8514 3.9318 1.8414 2.7441 2.1865 20.3908 3.4694 9.6371 8.3351 6.1113 30.2243 26.8349 22.5971 23.9829 3.8141 16.8214 6.9147 0.7332 0.6047 6.9406 0.3648 1.7267 0.2998 0.3332 20.9601 258.0713 7.8403 1.2893 2.4057 4.2239 113.2121 5.2549 8.1466 1.3300 10.0640 14.8632 4.9598 27.5468 19.8065 16.2367 13.1738 13.5910 13.1155 30.9094 13.8118 20.7855 9.3860 29.0172 5.9430 183.3132 2.4252 18.3137 6.0461 2.2655 8.8720 11.7214 6.1998 6.1013 1.6140 0.1502 5.5980 6.9490 3.0582 8.2050 15.1359 7.4886 3.9272 6.4370
temp: 298.150 k
press: 1.00000 atm
elementType: 8 8 7 6 6 6 6 6 6 6 6 6 1 1 1 1 1 1 1 1 1 1 1 1 1 1 1 1 1 1
symmnumber: 1
zpe: 697865.7 jmol-1
zpe.correction: 0.265803 hartree
zpe.thermalcorrener: 0.279392 hartree
zpe.thermalcorrenthalpy: 0.280336 hartree
zpe.thermalcorrgfe: 0.223512 hartree
zpe.sumelectzpe: -557.731134 hartree
zpe.sumelectthermal: -557.717545 hartree
zpe.sumelectthermalent: -557.716601 hartree
zpe.sumelectthermalfe: -557.773425 hartree
dipole: 5.4642 2.5550 0.5168
dipole: 6.0542
quadrupole: -28.8219 -67.0756 -64.9995
quadrupole: -0.5556 -1.5435 -2.6232
quadrupole: 24.8104 -13.4432 -11.3672 -0.5556 -1.5435 -2.6232
hfenergy: -557.9969367 hartree
pointgroup: C01 [X(C9H18N1O2)]
dipole: -2.1418712 1.0189091 -0.2182907 debye
polarizability: 130.6542741|2.7819361|95.1221746|-2.7887072|-2.232526|87.2424354 unknown
InChI: InChI=1S/C9H18NO2/c1-10(6-3-4-7-10)8-5-9(11)12-2/h3-8H2,1-2H3
charge 1 multiplicity 1
30 atoms
O  3.487695 0.452577 -0.393423
O  2.3242 -1.347254 0.532077
N  -1.455518 0.491528 0.051761
C  -1.81951 -0.396076 -1.190602
C  -2.513684 0.11744 1.140217
C  -2.980583 -1.304939 -0.737267
C  -3.692071 -0.47664 0.358002
C  -0.047318 0.175749 0.587493
C  -1.583172 1.971145 -0.294154
C  1.105116 0.622242 -0.327917
C  2.351522 -0.212211 0.002586
C  4.785592 -0.261448 -0.190925
H  -0.920636 -0.947957 -1.502994
H  -2.124424 0.286398 -1.999538
H  -2.741996 1.017999 1.730825
H  -2.049234 -0.639677 1.79361
H  -2.598934 -2.253057 -0.319422
H  -3.641521 -1.553902 -1.582563
H  -4.327582 0.312865 -0.082091
H  -4.330688 -1.093364 1.01002
H  0.007262 -0.916777 0.738049
H  0.028987 0.659115 1.577398
H  -0.943515 2.205634 -1.157329
H  -2.63255 2.189801 -0.544597
H  -1.273077 2.573978 0.573658
H  0.878465 0.438732 -1.396913
H  1.352546 1.691064 -0.228186
H  4.937822 -0.456947 0.882448
H  5.542415 0.428874 -0.584401
H  4.778691 -1.212291 -0.747323
