program: Gaussian 09
title: 000089159
version: EM64L-G09RevD.01
frameworkgroup: C1[X(C11H12O4)]
method: RPBEPBE
basis: SDD
operation: Freq
keyword: #pfreq=noraman
keyword: PBEPBE/SDD
title: #p freq=noraman PBEPBE/SDD
converged: YES YES NO NO
title: Mulliken charges:
elementType: O O O O C C C C C C C C C C C H H H H H H H H H H H H
charge: -0.265888 -0.262874 -0.134668 -0.190034 0.513921 -0.657366 -0.317282 -0.448443 0.319541 -0.363738 -0.350096 0.135875 0.156130 -0.538561 -0.499008 0.260385 0.268071 0.237493 0.225379 0.250204 0.239195 0.221564 0.245442 0.219144 0.249113 0.248637 0.237865
chargesum: 0.00000
title: Mulliken charges with hydrogens summed into heavy atoms:
elementType: O O O O C C C C C C C C C C C
charge: -0.265888 -0.262874 -0.134668 -0.190034 0.513921 -0.128910 -0.079789 -0.223064 0.319541 -0.113534 -0.110901 0.135875 0.156130 0.147588 0.236607
polarizability: 1.97465185e+02 -4.29217954e+00 1.20205005e+02 7.42410681e+00 6.34235526e+00 8.15823376e+01
1716.lowfreq: -5.2154 0.0005 0.0008 0.0009 4.6708 7.2398 15.9938 27.1751 28.8917
frequency: 12.8142 26.6751 28.7942 59.8286 95.3126 97.7178 138.0923 151.0256 175.3550 209.2781 242.3771 267.3674 320.2526 337.7064 352.0857 406.0770 414.1972 420.2235 453.7671 510.2333 531.9240 629.6581 648.9818 693.5278 711.3670 748.1852 785.0753 810.8353 821.7163 844.1711 909.2914 922.5435 940.6363 961.6762 989.0631 1004.6864 1019.6537 1111.1042 1112.6355 1113.5598 1133.7573 1147.2475 1157.3035 1168.3239 1182.5446 1216.6295 1232.8541 1301.2480 1322.9038 1385.0064 1415.9852 1418.7006 1422.6033 1436.9603 1452.5508 1460.6174 1467.6667 1474.0994 1505.9512 1586.1672 1627.7800 1634.6297 1647.9936 2957.7768 2958.7897 3008.1088 3033.7591 3044.5965 3112.1464 3119.7834 3124.8379 3140.4396 3156.9476 3162.8202 3169.5587
redmass: 5.7464 5.6357 4.5209 4.5391 1.0927 3.3877 4.7358 3.9554 4.0218 2.9642 1.1947 4.3048 2.4885 7.4273 7.0443 4.9905 3.0991 4.7031 5.3848 2.8558 4.3819 6.3696 4.0518 5.4199 3.6335 5.1409 3.3001 1.6843 2.1367 2.4593 2.0675 8.5080 1.5997 1.3789 8.6930 2.7311 4.3685 1.2961 1.3044 1.3168 6.3574 1.4362 1.3328 1.1410 1.2486 1.8869 3.7904 1.4525 1.7724 4.4424 1.6049 1.1738 1.7845 1.1701 1.0495 1.0506 1.0502 1.0743 2.5386 7.0411 6.4924 10.2475 10.3281 1.0378 1.0630 1.0294 1.0887 1.1037 1.1048 1.0896 1.0991 1.0890 1.1052 1.0936 1.0963
irintensity: 0.1854 0.2875 1.4997 1.3047 0.0961 3.8879 2.8695 2.7014 4.2101 4.1360 0.4242 10.5813 3.9461 4.9803 1.8109 7.3536 0.6859 2.7610 1.2739 23.2731 24.9883 0.5879 3.6466 24.8244 2.0316 17.9166 15.9967 17.8891 8.1810 35.0012 6.6924 11.1922 1.3844 0.6043 38.2078 4.2043 191.0913 6.7451 9.3439 11.7675 145.0033 10.8995 1.1573 2.5790 58.2305 2.9209 178.4138 17.9623 31.2969 5.1768 18.3073 6.3446 20.9119 9.9885 15.7763 9.5604 13.6162 54.3578 119.9768 10.2044 56.7556 222.6104 2.8494 90.3712 11.5101 25.5065 3.3223 50.6745 20.3893 21.8645 20.0345 12.0334 12.1278 15.9756 3.6512
temp: 298.150 k
press: 1.00000 atm
elementType: 8 8 8 8 6 6 6 6 6 6 6 6 6 6 6 1 1 1 1 1 1 1 1 1 1 1 1
symmnumber: 1
zpe: 543215.6 jmol-1
zpe.correction: 0.206900 hartree
zpe.thermalcorrener: 0.222311 hartree
zpe.thermalcorrenthalpy: 0.223255 hartree
zpe.thermalcorrgfe: 0.160928 hartree
zpe.sumelectzpe: -726.119816 hartree
zpe.sumelectthermal: -726.104405 hartree
zpe.sumelectthermalent: -726.103461 hartree
zpe.sumelectthermalfe: -726.165788 hartree
dipole: -0.0149 -5.3402 1.2138
dipole: 5.4765
quadrupole: -66.4344 -88.9395 -88.0457
quadrupole: -7.5970 11.4492 7.4966
quadrupole: 14.7055 -7.7996 -6.9058 -7.5970 11.4492 7.4966
hfenergy: -726.3267159 hartree
pointgroup: C01 [X(C11H12O4)]
dipole: 0.0272141 -1.885562 1.0422229 debye
polarizability: 197.2506022|-0.028404|120.557866|10.1326867|-4.7155838|81.4440598 unknown
InChI: InChI=1S/C11H12O4/c1-14-9-5-3-8(4-6-9)7-10(12)11(13)15-2/h3-6H,7H2,1-2H3
charge 0 multiplicity 1
27 atoms
O  -4.608836 0.299942 -0.080912
O  3.813243 -0.713069 0.552105
O  1.530398 1.432747 -1.171601
O  4.351668 1.035131 -0.89723
C  -0.407296 -0.164844 0.339774
C  1.090913 -0.309659 0.524218
C  -1.057194 1.088657 0.505503
C  -1.201065 -1.289188 0.019331
C  -3.229312 0.069059 0.040565
C  -2.449117 1.209325 0.360757
C  -2.604034 -1.189247 -0.132411
C  1.958453 0.562471 -0.383834
C  3.501569 0.352464 -0.294617
C  -5.455947 -0.842179 -0.42979
C  5.262921 -1.006586 0.707141
H  1.39782 -0.068444 1.565411
H  1.415091 -1.358649 0.388046
H  -0.467012 1.981889 0.737225
H  -0.723146 -2.267257 -0.117441
H  -2.954442 2.17204 0.483043
H  -3.183707 -2.08291 -0.381658
H  -5.17308 -1.268438 -1.412214
H  -6.477252 -0.437287 -0.481843
H  -5.407427 -1.63265 0.344787
H  5.785716 -0.121967 1.10717
H  5.69789 -1.275942 -0.269735
H  5.305386 -1.84921 1.410308
