program: Gaussian 09
title: 000007805
version: EM64L-G09RevD.01
frameworkgroup: C1[X(C7H7Br)]
method: RPBEPBE
basis: SDD
operation: Freq
keyword: #pfreq=noraman
keyword: PBEPBE/SDD
title: #p freq=noraman PBEPBE/SDD
converged: NO NO NO NO
title: Mulliken charges:
elementType: Br C C C C C C C H H H H H H H
charge: -0.000423 0.445121 -0.373334 -0.372630 -0.799901 -0.176909 -0.177019 -0.207399 0.236920 0.236909 0.226770 0.226716 0.238835 0.248174 0.248170
chargesum: 0.00000
title: Mulliken charges with hydrogens summed into heavy atoms:
elementType: Br C C C C C C C
charge: -0.000423 0.445121 -0.136413 -0.135721 -0.107580 0.071265 0.071151 -0.207399
polarizability: 1.39053223e+02 -7.95283963e-03 8.25159739e+01 4.54227360e-01 4.10918847e-04 3.82308082e+01
1716.lowfreq: -9.4083 -2.5228 0.0003 0.0005 0.0006 25.5378 40.0472 101.5260 201.4115
frequency: 38.8645 101.5236 201.4100 275.6550 284.6502 352.3901 406.5137 483.2405 576.9157 625.5890 699.9156 780.5895 811.6002 832.8305 948.3987 969.5187 985.3002 994.6065 1047.9987 1061.4143 1116.4308 1189.0266 1218.0268 1295.8669 1361.4550 1388.1190 1397.9734 1470.5859 1473.8726 1474.6830 1579.8230 1599.1229 2976.2263 3058.2781 3083.9038 3128.7752 3130.5452 3158.7324 3162.3574
redmass: 1.0346 4.4039 4.8482 9.5302 4.3019 2.7111 2.8734 2.6954 5.5328 6.9683 3.3688 4.8561 1.3586 1.2483 1.2972 1.3749 1.4053 5.0352 1.5589 2.6199 1.3097 1.1124 3.0277 1.2643 5.9335 2.9943 1.2225 1.0909 2.4033 1.0610 6.4183 6.1721 1.0381 1.0958 1.0997 1.0892 1.0890 1.0955 1.0967
irintensity: 0.5732 0.5748 0.0618 3.3184 0.4993 0.2097 0.0115 31.4241 12.7133 0.1284 0.1284 12.0526 63.5898 0.0012 1.0784 0.0107 0.4812 44.3050 20.9747 23.2883 9.9561 1.2232 3.3826 0.1707 0.0101 2.8060 11.6182 14.0838 82.7943 15.8469 0.7781 3.4313 33.2140 21.8836 17.6264 10.5855 12.8949 15.2503 0.0589
temp: 298.150 k
press: 1.00000 atm
elementType: 35 6 6 6 6 6 6 6 1 1 1 1 1 1 1
symmnumber: 1
zpe: 303508.9 jmol-1
zpe.correction: 0.115600 hartree
zpe.thermalcorrener: 0.123370 hartree
zpe.thermalcorrenthalpy: 0.124314 hartree
zpe.thermalcorrgfe: 0.081434 hartree
zpe.sumelectzpe: -283.827938 hartree
zpe.sumelectthermal: -283.820168 hartree
zpe.sumelectthermalent: -283.819224 hartree
zpe.sumelectthermalfe: -283.862104 hartree
dipole: 2.6854 -0.0008 0.0564
dipole: 2.6859
quadrupole: -50.9494 -50.5144 -60.6139
quadrupole: -0.0029 0.2132 0.0000
quadrupole: 3.0765 3.5115 -6.5880 -0.0029 0.2132 0.0000
hfenergy: -283.9435383 hartree
pointgroup: C01 [X(C7H7Br1)]
dipole: 1.0565866 0.0003177 -0.0175308 debye
dipolederiv: -0.7511257 0.0000009 -0.0028125 -0.0000034 -0.0790681 0.0000004 -0.0039698 0. -0.0472315 0.4005408 0.0002094 -0.0165496 0.0005265 -0.0652614 0.0000106 -0.0843893 0.0000206 -0.0218014 -0.0853981 -0.0501619 -0.0003816 -0.0508768 0.0731219 0.0071313 0.0063495 0.0067107 -0.168366 -0.0853731 0.0501919 -0.0004211 0.0508153 0.0732838 -0.0071577 0.0063484 -0.0067815 -0.1684193 -0.1444111 -0.000214 0.0112462 -0.0011532 0.0760594 -0.0000112 0.1159593 0.0000364 0.0654119 -0.354408 0.0889484 -0.0023643 0.0257648 0.0340151 -0.0050423 0.0059339 -0.0016499 -0.0933954 -0.3545899 -0.0888807 -0.0023558 -0.0257706 0.0340069 0.0050451 0.0059423 0.001675 -0.0934285 1.2769722 -0.0000193 0.010759 0.0001299 0.003185 0.0000023 0.0073849 -0.0000054 -0.1340222 -0.0044025 0.0973124 -0.0038224 0.0847439 -0.0499469 -0.0010443 -0.0067237 0.0033989 0.154714 -0.0043162 -0.0972614 -0.0038055 -0.0847588 -0.0499705 0.0010457 -0.0067199 -0.0033907 0.1546743 0.0198138 -0.0249878 -0.0225669 -0.1062277 -0.0625378 -0.1021996 -0.076239 -0.0799784 0.0616565 0.0202647 0.0250099 -0.0222186 0.1071017 -0.0640137 0.1012467 -0.0753731 0.0791573 0.0629769 -0.0369043 -0.0001717 0.0577711 -0.0002818 0.1153576 0.0009727 0.1111961 0.0008068 -0.097082 0.051673 -0.0770037 -0.0012387 -0.0729173 -0.0191139 0.0004808 -0.0028498 0.0011066 0.1621603 0.0516646 0.0770275 -0.0012391 0.0729075 -0.0191175 -0.0004806 -0.0028498 -0.0011064 0.1621526 unknown
polarizability: 139.0552688|0.0081862|82.515974|-0.0084495|0.0004926|38.2287625 unknown
InChI: InChI=1S/C7H7Br/c1-6-2-4-7(8)5-3-6/h2-5H,1H3
charge 0 multiplicity 1
15 atoms
Br -3.332771 -0.000003 -0.018515
C  1.470553 -0.000052 0.014676
C  0.739818 -1.216413 0.011368
C  0.73982 1.216352 0.011372
C  2.990137 0.000045 -0.001348
C  -0.673878 -1.227358 -0.001076
C  -0.673844 1.227306 -0.001074
C  -1.368473 -0.00003 -0.007263
H  1.275806 -2.172898 0.018676
H  1.275821 2.172834 0.018691
H  3.400415 0.891112 0.506089
H  3.400481 -0.894883 0.499145
H  3.376427 0.004144 -1.039012
H  -1.219618 -2.176364 -0.001814
H  -1.219595 2.176308 -0.001814
