program: Gaussian 09
title: 000086943
version: EM64L-G09RevD.01
frameworkgroup: C1[X(C9H17NO7S)]
method: RPBEPBE
basis: SDD
operation: Freq
keyword: #p
keyword: freq=noraman
keyword: PBEPBE/SDD
title: #p freq=noraman PBEPBE/SDD
converged: YES YES NO NO
title: Mulliken charges:
elementType: S O O O O O O O N C C C C C C C C C H H H H H H H H H H H H H H H H H
charge: 0.201497 -0.483900 -0.493818 -0.473329 -0.462408 -0.492886 -0.412519 -0.235087 -0.373587 -0.572818 0.040945 -0.162702 -0.155001 -0.137818 -0.695710 -0.108565 -0.384984 0.212889 0.289197 0.219099 0.240265 0.269612 0.267428 0.309377 0.325971 0.264739 0.256936 0.373639 0.238639 0.217820 0.426613 0.379810 0.361815 0.363999 0.384839
chargesum: 0.00000
title: Mulliken charges with hydrogens summed into heavy atoms:
elementType: S O O O O O O O N C C C C C C C C C
charge: 0.201497 -0.110261 -0.067204 -0.093519 -0.100593 -0.128886 -0.027680 -0.235087 -0.064210 -0.283621 0.260044 0.077563 0.114611 0.129610 -0.104999 0.148371 0.071476 0.212889
polarizability: 1.72219371e+02 -2.81870425e+00 1.42932308e+02 -7.42456806e+00 -3.50974030e-01 1.13251719e+02
1716.lowfreq: -3.1859 -0.0018 -0.0011 0.0006 3.8659 16.7123 25.8964 41.4535 54.2430
frequency: 25.7742 41.4285 54.0393 61.3258 87.6731 110.7075 119.7497 130.3558 160.6940 175.6660 201.5375 214.3955 231.6424 241.7778 267.6465 278.6097 299.1103 303.9618 329.9864 340.4901 404.8516 410.3841 452.9829 469.3440 515.1381 534.1717 563.3746 577.1150 587.5350 607.4936 631.2495 671.6730 690.7678 712.9448 736.1637 755.9162 777.2742 796.5055 815.2725 849.4269 861.9726 877.1232 893.6963 909.8875 937.5997 951.3911 975.3815 980.6822 992.2459 1025.6532 1030.0677 1049.8723 1071.2795 1087.2150 1107.4362 1131.5459 1140.9908 1154.7906 1179.1540 1185.1644 1220.6666 1231.8401 1244.2030 1249.8155 1267.9675 1275.5753 1277.2056 1285.8473 1293.6949 1318.5340 1332.6733 1355.3600 1361.9178 1381.8115 1383.1529 1394.7398 1428.8620 1441.7955 1445.0565 1453.8183 1468.1243 1677.3524 2968.7334 2982.0078 2996.3452 3009.2543 3044.3244 3053.5405 3056.5907 3059.9005 3068.8751 3072.3754 3166.2315 3220.8919 3290.5698 3471.0324 3471.6586 3521.0631 3613.3364
redmass: 6.8167 8.4934 6.0331 5.9374 5.5011 5.2830 6.1860 6.4687 4.9938 9.5623 3.9300 1.5804 2.5404 4.6816 5.2311 5.9142 4.9568 5.1877 5.4816 5.4765 4.4559 3.4131 4.1052 4.4521 4.0965 1.1396 1.5749 4.4030 2.2025 1.5154 2.5966 2.4489 3.0458 5.3610 2.9333 4.2928 3.7687 2.1536 3.2451 3.0378 2.6388 2.0800 2.3851 1.6079 2.0981 2.0371 3.4804 3.6591 3.4552 3.1535 2.7408 2.4376 2.6643 2.2831 1.9001 2.1810 1.1901 1.3858 1.2828 1.1662 1.3911 1.2366 1.2669 1.2351 1.2321 1.3173 1.1840 1.4086 1.4698 1.2875 1.3778 1.1819 1.4014 1.2508 1.4097 1.3758 1.2342 1.1908 1.1738 1.2681 1.0795 9.1494 1.0842 1.0573 1.0831 1.0843 1.0721 1.0862 1.1047 1.0861 1.0872 1.0593 1.1076 1.0683 1.0629 1.0757 1.0648 1.0642 1.0671
irintensity: 1.1884 4.7660 0.9162 1.3744 0.8610 1.5088 4.2555 1.7948 12.7208 5.7742 21.8545 115.7399 18.0667 18.1789 14.6500 2.7001 7.7482 7.2066 8.2571 4.2797 11.5775 15.4773 8.6376 5.8371 31.6334 110.6476 134.7159 27.6419 47.1405 67.4703 80.6923 106.2351 42.4618 0.8237 101.5097 17.4819 19.8898 60.0638 26.6076 28.4840 37.1900 31.8086 44.4540 75.6212 53.9620 17.1797 22.2870 82.0123 81.7741 80.9818 145.2665 9.9920 79.8572 125.4113 2.9758 26.1582 12.3784 7.5598 2.6907 54.0839 11.8786 7.3794 8.1761 2.1087 9.6571 57.8067 2.9451 6.8882 8.9391 12.0064 12.2707 1.4346 6.0448 68.0283 3.0961 35.4194 43.9138 15.9848 57.6328 53.2230 18.9798 222.1400 27.6448 58.7718 29.6079 78.5549 580.3290 21.7133 15.1327 61.1665 32.1014 10.5248 1.1623 312.0963 130.7119 10.6404 37.2834 33.7741 10.6190
temp: 298.150 k
press: 1.00000 atm
elementType: 16 8 8 8 8 8 8 8 7 6 6 6 6 6 6 6 6 6 1 1 1 1 1 1 1 1 1 1 1 1 1 1 1 1 1
symmnumber: 1
zpe: 721563.8 jmol-1
zpe.correction: 0.274829 hartree
zpe.thermalcorrener: 0.293838 hartree
zpe.thermalcorrenthalpy: 0.294782 hartree
zpe.thermalcorrgfe: 0.227007 hartree
zpe.sumelectzpe: -1331.058725 hartree
zpe.sumelectthermal: -1331.039717 hartree
zpe.sumelectthermalent: -1331.038772 hartree
zpe.sumelectthermalfe: -1331.106547 hartree
dipole: 0.3480 1.4269 0.0490
dipole: 1.4695
quadrupole: -89.5571 -112.1031 -117.2197
quadrupole: 0.4085 15.5080 -5.2282
quadrupole: 16.7362 -5.8098 -10.9264 0.4085 15.5080 -5.2282
hfenergy: -1331.3335546 hartree
pointgroup: C01 [X(C9H17N1O7S1)]
dipole: 0.1232345 0.1711286 0.5383214 debye
polarizability: 169.770573|12.8179736|118.6175878|-6.3817182|8.2156397|140.0152381 unknown
InChI: InChI=1S/C9H17NO7S/c11-1-4(12)5(13)6(14)7(15)8-10-3(2-18-8)9(16)17/h3-8,10-16H,1-2H2
charge 0 multiplicity 1
35 atoms
S  2.815986 0.214306 -2.505292
O  0.487183 1.26032 -0.562325
O  -0.416247 -1.412485 0.669135
O  -1.748826 0.807233 0.971473
O  -3.711152 -1.678261 -1.086107
O  -5.042571 0.593063 -0.658781
O  3.306326 1.807189 1.805319
O  1.57208 0.325873 2.231665
N  2.142655 -1.086445 -0.209048
C  1.497209 -0.753919 -1.501411
C  0.187409 0.033068 -1.307108
C  -0.890703 -0.841434 -0.603533
C  -2.13335 0.0015 -0.216233
C  3.065511 -0.012137 0.257551
C  3.38022 1.014491 -0.890894
C  -3.349812 -0.899596 0.107362
C  -4.556051 -0.074616 0.573299
C  2.517709 0.68891 1.506146
H  1.289241 -1.679561 -2.066034
H  -0.206721 0.299415 -2.310946
H  -1.205408 -1.651934 -1.289373
H  -2.407253 0.72526 -1.003253
H  4.015114 -0.486092 0.577341
H  2.644208 -1.980207 -0.282235
H  2.81178 1.940597 -0.751278
H  4.458518 1.217499 -0.965804
H  -3.058837 -1.631782 0.880729
H  -0.260634 1.42062 0.095018
H  -4.23492 0.665037 1.330178
H  -5.338619 -0.743301 0.983019
H  0.598018 -1.316803 0.693022
H  -1.219856 0.151066 1.527309
H  -4.323712 -1.090525 -1.608913
H  -5.863544 1.107026 -0.469544
H  2.961447 2.243125 2.630845
