program: Gaussian 09
title: 000086924
version: EM64L-G09RevD.01
frameworkgroup: C1[X(C20H26N2O3)]
method: RPBEPBE
basis: SDD
operation: Freq
keyword: #p
keyword: freq=noraman
keyword: PBEPBE/SDD
title: #p freq=noraman PBEPBE/SDD
converged: YES YES NO NO
title: Mulliken charges:
elementType: O O O N N C C C C C C C C C C C C C C C C C C C C H H H H H H H H H H H H H H H H H H H H H H H H H H
charge: -0.255974 -0.256947 -0.309221 -0.095634 -0.088695 -0.381429 -0.380746 -0.342650 -0.342933 -0.295513 -0.295758 -0.685534 -0.685807 0.352110 0.350008 0.377346 -0.310943 -0.354813 -0.342126 -0.362993 -0.326536 -0.357692 0.170043 -0.308714 -0.348175 0.212388 0.212279 0.211539 0.211378 0.194373 0.194153 0.194734 0.194490 0.206446 0.206302 0.207123 0.207238 0.213073 0.218770 0.212948 0.212671 0.218639 0.212624 0.251862 0.255301 0.282200 0.290728 0.248981 0.252483 0.307616 0.248988
chargesum: 0.00000
title: Mulliken charges with hydrogens summed into heavy atoms:
elementType: O O O N N C C C C C C C C C C C C C C C C C C C C
charge: -0.255974 -0.256947 -0.309221 -0.095634 -0.088695 0.043238 0.042171 0.045876 0.046291 0.117235 0.118602 -0.040743 -0.041873 0.352110 0.350008 0.377346 -0.059081 -0.099513 -0.059926 -0.072265 -0.077555 -0.105208 0.170043 -0.001099 -0.099187
polarizability: 5.82069281e+02 -2.69391287e+01 2.33920696e+02 6.02685065e-02 3.84799102e-01 1.30955310e+02
1716.lowfreq: -13.0594 -4.1254 -2.6476 -0.0018 0.0011 0.0018 10.9663 27.1645 28.2182
frequency: 6.9719 26.9951 28.0654 30.7967 45.7757 53.1032 55.2305 64.3206 82.8176 91.4733 94.7751 111.5012 134.8871 136.6169 146.3872 150.6801 195.4729 201.2404 203.3619 219.2876 237.3923 257.2699 260.8817 307.2674 344.2053 360.8273 382.1845 397.2755 400.5738 419.1401 422.2280 464.1702 485.5354 499.1638 501.4367 535.6334 564.4641 623.9532 626.5450 634.7903 640.5006 727.8024 736.2561 741.3720 744.2044 757.2448 790.7739 806.8869 807.3734 822.3942 823.9604 827.5347 843.6773 849.9757 853.6702 903.8277 904.8668 938.6517 942.5714 962.5723 963.4841 964.9943 971.8676 973.2213 983.4079 992.8727 994.1577 1041.1272 1041.3502 1073.6127 1083.6950 1084.7041 1106.6979 1112.1045 1124.6542 1125.1624 1144.5066 1144.9573 1157.0495 1172.0109 1208.6923 1212.1764 1213.4198 1213.8687 1228.5145 1238.9517 1274.4498 1279.1856 1281.0423 1282.3849 1286.7478 1288.6040 1291.2155 1298.9331 1344.3332 1348.7968 1351.2669 1376.0786 1378.6585 1384.3321 1391.2473 1393.0692 1398.5055 1429.1985 1436.8162 1467.5236 1468.9746 1470.6596 1472.0510 1475.6605 1476.0037 1478.4379 1478.6038 1483.8981 1486.5599 1490.9229 1492.4462 1554.3430 1589.7089 1610.5015 1614.6539 2949.3040 2950.2438 2967.3843 2969.1894 2976.3674 2977.2821 2995.1439 2997.8473 3007.6487 3007.9251 3012.2841 3013.5170 3060.2679 3062.1401 3075.1825 3076.5285 3077.1776 3077.7166 3152.2336 3156.2135 3161.8681 3164.8843 3174.7584 3189.0705 3192.4863 3214.4886
redmass: 4.2630 3.7291 3.9197 2.4311 4.6598 2.9055 2.7031 1.8522 4.0596 4.6680 4.1690 3.7464 4.2999 3.0393 1.9874 2.6243 4.4429 4.2626 7.3714 1.1714 1.1075 5.0387 4.6327 6.9334 4.8313 5.7698 4.0569 3.2493 6.9535 3.0747 3.0724 5.9869 4.6689 3.9237 2.9518 2.4439 6.5109 7.2626 7.0501 5.8125 7.1280 4.0877 3.8823 1.0760 1.0755 6.4974 6.4467 1.1945 1.2088 1.1968 1.2060 6.7954 1.6379 1.6086 9.9651 1.7987 1.8084 1.1559 1.1611 6.9710 6.8456 1.3502 1.3421 1.3317 1.3292 2.7005 2.8248 3.4337 3.4309 3.4065 2.1926 2.2064 1.2816 1.3393 2.5354 2.4347 1.4425 1.4504 1.2826 1.3177 3.5342 3.7737 1.3698 1.3653 3.6285 4.4545 1.3043 1.2993 1.1705 1.1754 1.0693 1.2955 1.0652 1.3694 2.4359 2.1280 1.4674 1.6875 1.5139 4.5132 1.2837 1.2244 4.5217 4.3173 4.5675 1.1617 1.1455 1.1554 1.1016 1.0422 1.4153 1.2399 1.0560 1.2289 1.4260 1.1364 1.2603 7.6362 7.9664 6.3119 6.6132 1.0551 1.0551 1.0589 1.0590 1.0362 1.0363 1.0592 1.0594 1.1054 1.1034 1.1037 1.1019 1.1044 1.1042 1.1015 1.1017 1.0995 1.0995 1.0878 1.0903 1.0890 1.0894 1.0975 1.0951 1.0955 1.0934
irintensity: 0.5656 0.0386 0.6051 0.7412 0.1913 0.0047 0.0227 0.0005 0.1136 0.2578 0.5938 2.1418 0.0366 0.3627 4.6352 0.6826 0.3504 1.4758 5.6739 0.3831 0.1192 0.5159 0.0232 0.0024 0.8491 17.5666 3.3469 1.6409 0.3286 0.0259 0.2009 29.9213 4.4491 0.1385 1.5275 36.3031 47.0084 0.4034 1.2094 8.0042 14.1237 1.0590 0.6405 11.1142 11.1470 22.6942 0.2887 3.0701 4.2043 0.4357 1.7941 3.4855 45.2206 114.8648 19.4053 31.0660 24.9497 0.1411 0.2210 190.5164 50.1934 1.1965 5.7234 0.6999 0.5108 8.1530 11.5114 65.2154 2.4511 13.4820 14.4580 9.7498 29.0044 29.8486 14.7784 12.3216 1.7679 1.7986 358.6528 53.2754 343.8163 88.2772 0.2229 0.0086 3.8985 549.9166 7.5179 6.4844 0.3184 0.3441 0.0898 4.1819 0.0917 3.0650 8.5703 8.2190 2.7535 12.6429 68.4198 10.1597 5.5226 3.6291 35.3713 7.7527 16.8092 17.6624 33.0067 17.6861 14.9016 13.2434 6.6321 191.3127 27.6595 1.5727 124.0396 5.9755 25.4903 2.0690 20.3063 404.0124 145.6854 34.2748 29.9123 33.9403 34.1200 43.5344 39.5191 36.6343 36.4081 25.4050 28.8696 0.0282 3.0421 17.6471 12.8118 101.5390 106.9636 50.7748 48.8835 6.4131 22.5239 15.3825 6.1692 9.9256 1.2401 6.3675 4.5615
temp: 298.150 k
press: 1.00000 atm
elementType: 8 8 8 7 7 6 6 6 6 6 6 6 6 6 6 6 6 6 6 6 6 6 6 6 6 1 1 1 1 1 1 1 1 1 1 1 1 1 1 1 1 1 1 1 1 1 1 1 1 1 1
symmnumber: 1
zpe: 1107066.4 jmol-1
zpe.correction: 0.421659 hartree
zpe.thermalcorrener: 0.447502 hartree
zpe.thermalcorrenthalpy: 0.448446 hartree
zpe.thermalcorrgfe: 0.361194 hartree
zpe.sumelectzpe: -1110.952135 hartree
zpe.sumelectthermal: -1110.926292 hartree
zpe.sumelectthermalent: -1110.925348 hartree
zpe.sumelectthermalfe: -1111.012600 hartree
dipole: -0.5041 -1.8859 0.0375
dipole: 1.9525
quadrupole: -91.7338 -146.5821 -153.5974
quadrupole: 16.8665 0.1056 0.0551
quadrupole: 38.9040 -15.9444 -22.9596 16.8665 0.1056 0.0551
hfenergy: -1111.3737943 hartree
pointgroup: C01 [X(C20H26N2O3)]
dipole: -0.2073345 0.2237667 0.7050048 debye
polarizability: 581.2929076|3.9376842|138.7629483|31.38976|27.2718811|226.8894314 unknown
InChI: InChI=1S/C20H26N2O3/c1-3-5-15-24-19-11-7-17(8-12-19)21-22(23)18-9-13-20(14-10-18)25-16-6-4-2/h7-14H,3-6,15-16H2,1-2H3
charge 0 multiplicity 1
51 atoms
O  -6.005175 0.275943 -0.974744
O  5.87716 0.686443 0.927598
O  0.19325 -0.176613 -2.262177
N  -0.334421 0.165325 -1.092193
N  0.31706 0.47599 0.018932
C  -8.244905 0.564854 -0.103088
C  8.263262 0.559306 0.545219
C  -9.140073 0.940378 1.101251
C  9.415598 0.275688 -0.447068
C  -6.757276 0.647073 0.242723
C  6.890303 0.390046 -0.107396
C  -10.643782 0.858557 0.761546
C  10.804454 0.440354 0.206547
C  -4.609319 0.274099 -0.912186
C  4.528119 0.598188 0.57453
C  -1.797036 0.208974 -1.004122
C  -3.854759 0.601904 0.246174
C  -3.944517 -0.086333 -2.113122
C  -2.447762 0.568219 0.196696
C  -2.542677 -0.119468 -2.161986
C  4.050517 0.239832 -0.712243
C  3.604966 0.897669 1.613282
C  1.72607 0.476436 0.067319
C  2.666373 0.17689 -0.969621
C  2.23246 0.836871 1.359497
H  -8.454442 1.2407 -0.954129
H  -8.479924 -0.462215 -0.441877
H  8.350187 1.5900 0.939145
H  8.336098 -0.124118 1.412814
H  -8.893483 1.967151 1.44058
H  -8.917033 0.266189 1.953333
H  9.332915 0.959315 -1.316546
H  9.315417 -0.753959 -0.847082
H  -6.475577 1.675749 0.550571
H  -6.498944 -0.054116 1.063567
H  6.748256 -0.647238 -0.475828
H  6.762969 1.090986 -0.958461
H  -10.901658 1.547869 -0.064034
H  -11.268422 1.125519 1.633181
H  -10.922925 -0.163702 0.444728
H  10.94355 1.469461 0.587237
H  11.615916 0.233207 -0.514443
H  10.924333 -0.252418 1.060373
H  -4.347696 0.881441 1.18121
H  -4.548094 -0.334544 -2.990934
H  -1.845114 0.815925 1.072924
H  -2.006409 -0.392736 -3.073606
H  4.745846 0.007103 -1.524155
H  3.993282 1.172113 2.598412
H  2.300061 -0.099167 -1.957891
H  1.506305 1.06456 2.146041
