program: Gaussian 09
title: 000086846
version: EM64L-G09RevD.01
frameworkgroup: C1[X(C10H18S)]
method: RPBEPBE
basis: SDD
operation: Freq
keyword: #pfreq=noraman
keyword: PBEPBE/SDD
title: #p freq=noraman PBEPBE/SDD
converged: NO YES NO NO
title: Mulliken charges:
elementType: S C C C C C C C C C C H H H H H H H H H H H H H H H H H H
charge: 0.171853 0.454527 -0.103040 -0.075234 -0.506919 -0.473752 -0.432558 -0.768025 -0.796104 -0.787848 -0.725198 0.210114 0.207297 0.235652 0.220210 0.211847 0.246741 0.204063 0.270687 0.255005 0.206889 0.247722 0.210695 0.220428 0.209742 0.216462 0.230671 0.208322 0.229751
chargesum: 0.00000
title: Mulliken charges with hydrogens summed into heavy atoms:
elementType: S C C C C C C C C C C
charge: 0.171853 0.454527 0.107074 -0.075234 -0.063970 -0.041695 0.018247 -0.242333 -0.130798 -0.141217 -0.056454
polarizability: 1.23690254e+02 -3.20376610e+00 1.18677752e+02 -3.59071765e+00 1.70132415e+00 1.07490641e+02
1716.lowfreq: -21.4996 -4.1809 -0.0028 -0.0027 -0.0022 20.5511 42.7283 163.4732 212.1877
frequency: 42.4866 163.4465 212.1870 219.8694 225.2075 257.1881 264.2715 297.4752 306.9177 341.7248 370.0150 372.7889 389.6786 408.5325 460.2640 490.5381 514.0629 535.4360 628.8776 653.8988 802.2304 806.2118 830.7882 868.0237 887.7777 902.9678 918.5384 934.7640 949.6167 977.9806 988.0848 1006.3416 1040.6865 1059.1233 1080.6330 1105.0472 1127.6774 1141.3228 1178.4881 1186.9487 1207.4773 1239.4007 1249.5222 1262.9587 1272.9051 1277.6995 1308.9616 1321.6059 1334.2568 1343.1515 1371.7258 1383.5768 1393.5998 1449.0115 1453.7668 1460.7597 1464.4461 1466.2209 1472.9078 1475.1778 1479.1074 1491.5412 1502.8824 2946.1662 2960.9759 2962.8515 2963.5662 2968.7679 2971.6533 3001.3109 3018.4642 3029.3407 3036.1896 3054.0827 3058.5390 3061.0939 3064.9158 3070.6474 3075.3462 3080.6926 3084.1597
redmass: 2.7523 2.5972 1.0700 2.2981 1.4511 2.1837 1.3573 2.7343 1.5147 3.1632 2.4644 1.9562 2.3367 2.2620 2.9538 3.9841 3.7027 3.7439 5.7601 3.2475 1.9442 2.0101 2.4501 2.3595 1.7546 2.0089 1.8895 1.5085 1.6070 1.7671 1.6781 1.4193 1.7149 1.5867 1.8303 1.5649 1.7311 1.1856 2.4586 2.2317 1.7861 1.5562 1.9396 1.8493 1.5022 1.2860 1.5062 1.6264 1.4530 1.5765 1.1989 1.2060 1.2086 1.0783 1.0811 1.0764 1.0540 1.0563 1.0512 1.0556 1.0588 1.0682 1.0656 1.0652 1.0750 1.0579 1.0452 1.0378 1.0381 1.0649 1.0593 1.0961 1.0963 1.0993 1.1010 1.0985 1.0979 1.0986 1.0991 1.0997 1.1068
irintensity: 1.1576 0.9311 0.0972 0.4322 0.0347 0.2281 0.2846 0.8724 0.0391 0.3213 0.0739 0.0690 0.5087 0.1909 0.3699 0.8334 0.7152 3.6979 2.5954 0.7685 3.4478 3.1737 2.2721 1.6440 1.2699 0.4791 3.1200 2.0745 3.5223 1.3662 2.9997 0.5952 2.9053 8.6306 1.0178 3.4658 2.2416 1.1415 10.8834 9.1529 7.7546 5.3521 9.6615 1.8496 9.8753 1.8065 8.5598 5.2053 2.6657 6.9103 20.1291 15.2510 18.5640 5.9438 5.6591 8.9972 3.6160 9.2948 14.0716 2.2738 4.0365 20.2162 3.8818 28.7143 10.5613 62.2178 5.3522 60.5323 52.0988 53.9388 56.8732 16.9891 2.6514 3.4235 27.4477 67.7007 39.5542 40.6629 38.5439 26.4243 19.9967
temp: 298.150 k
press: 1.00000 atm
elementType: 16 6 6 6 6 6 6 6 6 6 6 1 1 1 1 1 1 1 1 1 1 1 1 1 1 1 1 1 1
symmnumber: 1
zpe: 676126.6 jmol-1
zpe.correction: 0.257523 hartree
zpe.thermalcorrener: 0.269089 hartree
zpe.thermalcorrenthalpy: 0.270033 hartree
zpe.thermalcorrgfe: 0.221316 hartree
zpe.sumelectzpe: -789.037675 hartree
zpe.sumelectthermal: -789.026109 hartree
zpe.sumelectthermalent: -789.025164 hartree
zpe.sumelectthermalfe: -789.073882 hartree
dipole: -1.4594 -1.3148 0.8616
dipole: 2.1450
quadrupole: -78.8240 -76.5761 -76.4052
quadrupole: -4.1391 0.2000 2.0632
quadrupole: -1.5556 0.6923 0.8632 -4.1391 0.2000 2.0632
hfenergy: -789.2951976 hartree
pointgroup: C01 [X(C10H18S1)]
dipole: -0.4847203 -0.2967325 0.6238192 debye
polarizability: 123.9280298|-4.5562126|116.3268504|-2.6808865|-3.9407213|109.6037671 unknown
InChI: InChI=1S/C10H18S/c1-9(2)7-10(3)5-4-8(9)6-11-10/h8H,4-7H2,1-3H3
charge 0 multiplicity 1
29 atoms
S  1.337095 1.070688 -1.273654
C  -1.298078 -0.409697 -0.133443
C  -0.883601 0.970853 0.49511
C  1.310081 -0.485237 -0.126437
C  0.001336 -1.264315 -0.387976
C  0.048366 0.779123 1.72456
C  1.346495 -0.003815 1.342865
C  -0.200841 1.909886 -0.521477
C  -2.059603 -0.197952 -1.47037
C  -2.245015 -1.163655 0.839251
C  2.556058 -1.30636 -0.493737
H  -1.812162 1.478909 0.832677
H  0.004472 -2.152503 0.280114
H  0.007907 -1.645378 -1.426332
H  -0.497445 0.250485 2.526482
H  0.307643 1.77529 2.130161
H  2.24592 0.619788 1.492283
H  1.461592 -0.897946 1.990393
H  -0.867905 2.169188 -1.358723
H  0.130289 2.838269 -0.025137
H  -2.919673 0.487869 -1.341588
H  -1.39531 0.210014 -2.252655
H  -2.452179 -1.164779 -1.838609
H  -1.772408 -1.349053 1.820836
H  -3.177725 -0.592264 1.010762
H  -2.525114 -2.146593 0.415644
H  3.481801 -0.734141 -0.302914
H  2.5899 -2.229924 0.116522
H  2.544602 -1.599852 -1.55901
