program: Gaussian 09
title: 000086842
version: EM64L-G09RevD.01
frameworkgroup: C1[X(C12H15NO2)]
method: RPBEPBE
basis: SDD
operation: Freq
keyword: #p
keyword: freq=noraman
keyword: PBEPBE/SDD
title: #p freq=noraman PBEPBE/SDD
converged: YES YES NO NO
title: Mulliken charges:
elementType: O O N C C C C C C C C C C C C H H H H H H H H H H H H H H H
charge: -0.352629 -0.263853 -0.603109 0.120091 0.388678 -0.777049 0.169693 -0.352265 -0.357990 -0.310197 -0.238882 -0.238097 -0.239892 -0.063822 -0.562101 0.240167 0.263511 0.220852 0.247295 0.237196 0.210758 0.220668 0.225463 0.225783 0.228965 0.363442 0.327159 0.229397 0.220915 0.219853
chargesum: 0.00000
title: Mulliken charges with hydrogens summed into heavy atoms:
elementType: O O N C C C C C C C C C C C C
charge: -0.352629 -0.263853 0.087492 0.120091 0.388678 -0.052519 0.169693 -0.104969 -0.120794 0.121230 -0.013419 -0.012314 -0.010927 0.165575 -0.121333
polarizability: 1.73703066e+02 4.94792820e+00 1.28353858e+02 -1.01596575e+01 1.46693700e+01 1.17425499e+02
1716.lowfreq: -10.5985 -4.4450 -0.0004 -0.0002 0.0004 13.5473 25.0516 37.4306 62.5316
frequency: 24.6701 37.1627 62.5217 67.3520 87.6509 112.7777 146.6503 213.3103 223.7548 263.4969 279.1252 286.3865 329.6149 334.8369 367.9219 401.8427 444.0789 480.1833 481.3813 528.4840 589.2226 591.2366 616.7576 643.6877 666.6826 699.3806 701.7390 722.0250 771.4207 837.6269 853.9168 855.8100 920.6300 928.1534 955.4577 971.1394 979.8414 984.8832 990.4638 997.6642 1009.7830 1024.0716 1061.3783 1073.6121 1078.6518 1112.8793 1140.5449 1148.3477 1172.0504 1188.7208 1214.8213 1224.3148 1282.1898 1313.4216 1331.3133 1350.9694 1378.7932 1381.1999 1430.1984 1434.9060 1467.8561 1473.8206 1479.5475 1486.5160 1558.0524 1591.2921 1610.4261 1646.1726 1662.8850 2952.9160 2997.0067 3022.0127 3090.4163 3096.6311 3108.0151 3111.9495 3123.7879 3133.7952 3147.7437 3157.4732 3169.0092 3200.9507 3497.2283 3663.6053
redmass: 3.8430 3.6068 5.3802 2.7475 5.4294 2.7046 3.3954 3.1970 4.0921 2.6353 1.2969 2.7615 3.1607 3.8619 4.6965 2.8270 2.5558 3.1268 3.2782 2.6479 2.0916 1.8740 6.2786 1.9975 1.0987 3.1090 2.4687 2.5710 2.4782 2.1775 1.2931 2.9013 1.5015 1.4405 1.3912 2.6484 1.4692 1.9670 5.7321 1.3376 1.2986 2.5223 2.2321 1.9261 1.9591 2.0017 2.3785 1.8125 1.0570 1.1524 2.9986 1.3273 1.2445 1.3461 2.3663 1.5336 1.5300 3.4491 1.2053 2.1412 1.0670 1.2714 1.5432 1.1383 1.2807 6.1348 5.9650 6.6082 4.7565 1.0578 1.0358 1.1026 1.0603 1.1008 1.0991 1.0944 1.0846 1.0881 1.0927 1.0959 1.0996 1.1145 1.0446 1.1041
irintensity: 0.4515 0.2044 10.2685 0.1873 1.7451 2.3500 1.5264 0.7704 5.4342 3.3977 2.6510 6.8618 3.7221 1.9507 9.6763 0.1251 1.6872 2.6900 7.4184 2.7535 78.2670 131.1068 0.1934 4.7659 70.9733 18.9371 33.3944 33.7186 28.3021 15.2036 0.4590 15.7255 3.0777 3.6256 111.3634 55.2620 5.9471 43.3670 0.5335 0.9548 7.4268 14.6350 52.2795 4.5803 6.1405 46.9903 9.9236 8.3724 0.5515 6.1455 27.0769 4.5530 0.8265 3.8116 87.7430 32.9697 33.4254 7.4422 17.0625 14.6613 5.2261 12.9462 15.8409 4.1532 155.3686 1.1289 3.1369 237.3652 8.0338 30.0268 13.1326 32.8760 12.8560 24.1966 9.7824 8.9987 0.5975 5.4910 24.5275 32.4445 12.4174 23.5378 49.7630 65.6270
temp: 298.150 k
press: 1.00000 atm
elementType: 8 8 7 6 6 6 6 6 6 6 6 6 6 6 6 1 1 1 1 1 1 1 1 1 1 1 1 1 1 1
symmnumber: 1
zpe: 641510.7 jmol-1
zpe.correction: 0.244339 hartree
zpe.thermalcorrener: 0.259517 hartree
zpe.thermalcorrenthalpy: 0.260461 hartree
zpe.thermalcorrgfe: 0.200801 hartree
zpe.sumelectzpe: -670.339373 hartree
zpe.sumelectthermal: -670.324194 hartree
zpe.sumelectthermalent: -670.323250 hartree
zpe.sumelectthermalfe: -670.382910 hartree
dipole: 2.4710 -2.6164 -0.1556
dipole: 3.6022
quadrupole: -84.2629 -94.9780 -79.6178
quadrupole: 7.6988 -3.1054 0.4625
quadrupole: 2.0233 -8.6917 6.6684 7.6988 -3.1054 0.4625
hfenergy: -670.5837113 hartree
pointgroup: C01 [X(C12H15N1O2)]
dipole: 0.8871332 0.9876566 0.4959632 debye
polarizability: 169.193539|-9.6287033|120.167033|16.535013|13.9909826|130.12185 unknown
InChI: InChI=1S/C12H15NO2/c1-3-9-15-12(2,11(13)14)10-7-5-4-6-8-10/h3-8H,1,9,13H2,2H3
charge 0 multiplicity 1
30 atoms
O  1.335374 -0.395549 0.09775
O  -1.059958 -2.923612 -0.898375
N  0.392917 -2.626811 0.905104
C  0.182878 -0.796818 -0.754896
C  -1.016822 0.141188 -0.506418
C  0.596146 -0.906431 -2.236847
C  -0.221027 -2.227905 -0.255867
C  -1.173689 0.756722 0.762539
C  -2.007767 0.355956 -1.495965
C  1.980895 0.886531 -0.268662
C  -2.28471 1.584613 1.029949
C  -3.122104 1.182657 -1.228351
C  -3.264147 1.802968 0.033347
C  2.797065 1.342324 0.911811
C  4.122834 1.620793 0.860944
H  1.551189 -1.455121 -2.311478
H  -0.16503 -1.479443 -2.790765
H  0.710087 0.087191 -2.70354
H  -0.418163 0.579321 1.535576
H  -1.923708 -0.131664 -2.471751
H  2.619336 0.745786 -1.162377
H  1.19257 1.633044 -0.502966
H  -2.389479 2.054617 2.014488
H  -3.881614 1.336511 -2.003152
H  -4.129297 2.443115 0.239416
H  1.113903 -2.025404 1.30761
H  0.169782 -3.539086 1.299461
H  2.242271 1.463733 1.852955
H  4.667448 1.982785 1.739832
H  4.701822 1.498292 -0.062971
