program: Gaussian 09
title: 000089144
version: EM64L-G09RevD.01
frameworkgroup: C1[X(C17H20O)]
method: RPBEPBE
basis: SDD
operation: Freq
keyword: #pfreq=noraman
keyword: PBEPBE/SDD
title: #p freq=noraman PBEPBE/SDD
converged: YES YES NO NO
title: Mulliken charges:
elementType: O C C C C C C C C C C C C C C C C C H H H H H H H H H H H H H H H H H H H H
charge: -0.452300 -0.352883 0.177306 0.235132 0.303728 0.318453 0.338154 0.278472 -0.430552 -0.451094 -0.444420 -0.430204 -0.858148 -0.863987 -0.847506 -0.804607 -0.240544 -0.247415 0.217040 0.233058 0.229542 0.233119 0.228443 0.232828 0.235696 0.243647 0.213959 0.262154 0.232916 0.238875 0.262073 0.221489 0.205030 0.229251 0.255299 0.226693 0.223604 0.347697
chargesum: 0.00000
title: Mulliken charges with hydrogens summed into heavy atoms:
elementType: O C C C C C C C C C C C C C C C C C
charge: -0.104603 -0.135843 0.177306 0.235132 0.303728 0.318453 0.338154 0.278472 -0.197494 -0.221552 -0.211300 -0.201761 -0.145977 -0.154957 -0.125068 -0.115027 -0.013851 -0.023811
polarizability: 2.30849526e+02 1.45513061e+01 1.63847262e+02 5.70509664e+00 1.53376347e+00 1.52034524e+02
1716.lowfreq: -8.7287 0.0004 0.0005 0.0007 8.6695 14.4976 43.1759 53.0817 58.2137
frequency: 43.0371 52.8734 58.1991 91.4534 136.6637 158.6717 166.8835 187.2064 193.6379 205.2270 214.4051 223.7600 237.4860 257.0837 265.7768 293.0911 313.7722 329.1245 349.2982 394.6102 442.0367 479.6269 491.4084 521.4336 522.6786 525.8804 530.4470 538.7425 557.1862 578.8530 683.2947 697.0820 750.4963 757.6569 777.2473 782.7335 806.2360 839.8319 896.6449 902.6224 909.9876 919.3158 961.8497 974.8897 981.0293 993.3095 998.9637 1035.2007 1039.4407 1041.8277 1044.2857 1046.6839 1049.3113 1093.7402 1099.7856 1156.3298 1165.7086 1176.6439 1179.2480 1236.0002 1252.2242 1255.4758 1257.1934 1270.4757 1299.2870 1352.7589 1359.1199 1378.6299 1396.0582 1398.3437 1405.0050 1406.8496 1426.6617 1428.8938 1451.6962 1452.7978 1456.9268 1467.0065 1471.3047 1474.4541 1478.6750 1484.2971 1488.0071 1490.4330 1589.7403 1591.7910 1600.4398 1602.5949 2967.1139 2970.9871 2973.4607 2992.4678 2994.4876 3048.1386 3050.5829 3079.6828 3079.8728 3083.0926 3083.5777 3088.7653 3094.5729 3115.8643 3118.0783 3125.2276 3127.4143 3153.1756 3154.4353 3547.5825
redmass: 3.9849 3.6173 4.1904 3.6022 2.9728 2.1202 1.1234 1.2209 1.7232 1.4768 2.1963 2.1354 1.6682 2.4186 1.5510 3.0150 3.5635 2.6965 2.8512 3.7344 2.8794 3.3999 3.7238 3.0368 4.5939 3.1747 5.1209 4.6784 4.1357 4.1221 4.0508 4.1287 4.4818 4.4170 1.2705 1.2124 4.4435 3.9058 1.3111 1.3082 3.1843 2.7486 4.2146 1.3400 1.3574 1.5684 1.5656 1.6664 1.5853 1.6217 1.6066 1.7734 1.6162 2.2663 1.9836 1.8247 2.3844 1.1817 1.2358 1.7204 1.7121 3.0107 2.5577 1.7391 1.4121 3.0101 2.9429 1.9916 1.2390 1.2209 1.2319 1.2224 2.3572 2.4203 1.9618 1.9780 1.0708 1.1217 1.0762 1.1384 1.1007 1.1680 1.1466 1.1535 7.2943 7.0133 5.5329 5.6019 1.0756 1.0412 1.0417 1.0364 1.0377 1.0969 1.0934 1.0977 1.0977 1.0986 1.0984 1.0985 1.0968 1.0853 1.0855 1.0914 1.0916 1.0997 1.0995 1.0660
irintensity: 0.5792 0.1872 0.0711 0.2318 0.4812 0.7016 5.6276 1.5995 4.4226 0.5744 4.9510 1.2029 0.3253 37.1363 64.8230 4.6909 21.9594 0.6962 1.5737 4.9102 1.1301 1.4748 3.7097 0.3588 2.4746 0.3355 1.2371 3.0935 1.2893 2.6586 19.3499 14.1844 2.5599 3.4836 45.6637 52.0206 0.1869 10.7211 0.1652 0.0254 20.3523 6.1665 38.8648 0.0620 0.9661 4.5972 5.5892 1.8615 21.4179 1.1566 2.2823 6.5234 15.1009 0.4353 27.3278 44.8321 2.0823 0.0218 3.1975 10.6618 2.3090 0.7929 0.6068 13.5241 10.3238 8.9112 1.0953 5.9442 26.3922 3.4918 4.7813 18.8043 0.3524 6.1639 8.2136 6.2859 5.8239 11.1602 13.1281 25.8987 8.7129 28.5728 26.8253 61.9513 13.4460 6.8983 2.2923 1.2814 26.4820 30.2386 37.8624 23.5609 38.1182 23.2232 12.4197 22.4864 29.1375 10.9092 39.3052 14.7261 12.4362 0.5591 0.3802 31.4806 28.0747 45.2499 32.3572 7.4968
temp: 298.150 k
press: 1.00000 atm
elementType: 8 6 6 6 6 6 6 6 6 6 6 6 6 6 6 6 6 6 1 1 1 1 1 1 1 1 1 1 1 1 1 1 1 1 1 1 1 1
symmnumber: 1
zpe: 838544.4 jmol-1
zpe.correction: 0.319385 hartree
zpe.thermalcorrener: 0.337270 hartree
zpe.thermalcorrenthalpy: 0.338214 hartree
zpe.thermalcorrgfe: 0.274823 hartree
zpe.sumelectzpe: -733.710136 hartree
zpe.sumelectthermal: -733.692251 hartree
zpe.sumelectthermalent: -733.691307 hartree
zpe.sumelectthermalfe: -733.754698 hartree
dipole: 1.9495 0.6561 -0.1166
dipole: 2.0603
quadrupole: -101.5531 -104.8348 -106.5205
quadrupole: 1.3651 4.7242 2.0184
quadrupole: 2.7497 -0.5320 -2.2177 1.3651 4.7242 2.0184
hfenergy: -734.0295209 hartree
pointgroup: C01 [X(C17H20O1)]
dipole: -0.7567657 0.2886112 0.0322671 debye
polarizability: 229.2499651|-17.2818786|165.1987457|7.2060372|-1.982947|152.2826003 unknown
InChI: InChI=1S/C17H20O/c1-11-7-5-8-12(2)15(11)17(18)16-13(3)9-6-10-14(16)4/h5-10,17-18H,1-4H3
charge 0 multiplicity 1
38 atoms
O  0.012383 -1.264638 -2.003135
C  -0.029344 -0.071997 -1.117062
C  -1.313059 -0.136744 -0.264162
C  1.312314 0.111109 -0.381687
C  -2.46099 0.587492 -0.728803
C  1.47225 1.352337 0.323129
C  -1.421025 -0.9563 0.905298
C  2.401132 -0.821821 -0.411577
C  -3.677076 0.510931 -0.005979
C  2.670456 1.619166 1.028193
C  -2.654484 -1.000328 1.603578
C  3.586775 -0.505858 0.306222
C  -2.43468 1.452573 -1.985298
C  0.399548 2.432236 0.32796
C  -0.27563 -1.803853 1.431441
C  2.415685 -2.143849 -1.170344
C  -3.776385 -0.270288 1.162746
C  3.729378 0.691445 1.031916
H  -0.127576 0.816343 -1.773464
H  -4.549278 1.068906 -0.366465
H  2.769223 2.568818 1.567274
H  -2.7306 -1.624264 2.50202
H  4.413455 -1.225974 0.284437
H  -2.036909 0.919059 -2.868444
H  -3.456174 1.785332 -2.236523
H  -1.817403 2.361237 -1.850025
H  0.159517 2.774316 -0.69814
H  -0.54604 2.087034 0.78218
H  0.745465 3.314015 0.893409
H  0.152427 -2.440409 0.638723
H  0.549707 -1.184996 1.825029
H  -0.627269 -2.462198 2.244744
H  3.379446 -2.65716 -1.001942
H  1.60143 -2.819805 -0.860916
H  2.279342 -1.99069 -2.252836
H  -4.720337 -0.319137 1.716986
H  4.654709 0.90294 1.579277
H  -0.920181 -1.450181 -2.284057
