program: Gaussian 09
title: 000086834
version: EM64L-G09RevD.01
frameworkgroup: C1[X(C10H10O3)]
method: RPBEPBE
basis: SDD
operation: Freq
keyword: #pfreq=noraman
keyword: PBEPBE/SDD
title: #p freq=noraman PBEPBE/SDD
converged: YES YES NO NO
title: Mulliken charges:
elementType: O O O C C C C C C C C C C H H H H H H H H H H
charge: -0.273965 -0.267066 -0.224997 -0.258345 -0.225065 0.481349 0.277119 -0.360640 -0.402162 -0.229719 -0.225050 -0.234943 -0.503066 0.263189 0.267879 0.259964 0.235700 0.229429 0.229630 0.231611 0.237800 0.243528 0.247822
chargesum: 0.00000
title: Mulliken charges with hydrogens summed into heavy atoms:
elementType: O O O C C C C C C C C C C
charge: -0.273965 -0.267066 -0.224997 0.004844 0.042814 0.481349 0.277119 -0.100676 -0.166462 -0.000290 0.004580 -0.003332 0.226083
polarizability: 1.67672093e+02 9.18500597e-01 1.06946654e+02 -7.95325397e+00 2.09818811e+00 7.36888277e+01
1716.lowfreq: -7.4312 -3.5301 -0.0007 -0.0007 -0.0006 5.9155 30.1511 45.4763 69.8692
frequency: 30.0856 45.4495 69.8667 83.6799 95.0334 176.5888 180.2062 220.0490 282.3145 319.1207 369.1617 402.9793 412.7768 520.5354 582.6187 614.1334 661.0627 690.5330 702.7934 744.3347 774.4347 814.2741 824.5511 854.3940 871.4159 924.4269 961.3234 977.9312 989.0540 998.0739 1026.0965 1057.5790 1083.7301 1092.4752 1112.7088 1138.5618 1149.0158 1173.4896 1179.6751 1186.5140 1235.9699 1298.5914 1329.1871 1381.9333 1396.7173 1422.7618 1444.6949 1452.0299 1462.0556 1487.9415 1593.3991 1616.3852 1644.8805 3007.0879 3098.9051 3109.9735 3121.9850 3129.8317 3137.5636 3141.1333 3152.4541 3154.4056 3166.9220
redmass: 4.2570 4.8142 2.1593 1.6621 3.4443 4.8081 4.4111 5.4622 4.8829 5.4062 5.3719 2.8537 6.3737 3.2644 6.4037 6.4702 6.2242 6.4627 1.9006 3.0496 2.7731 6.5657 5.3685 1.2516 4.5508 1.5201 5.3358 1.3957 6.0780 1.3192 2.1759 1.3377 1.5274 1.2496 1.2687 3.6863 1.4925 1.0922 2.0905 1.1690 1.5139 1.6688 1.3260 4.7452 2.9211 1.2219 2.2128 1.0496 1.0515 2.4714 6.1281 6.0413 9.8587 1.0295 1.0899 1.1047 1.0868 1.0868 1.0906 1.0915 1.0963 1.1049 1.1016
irintensity: 1.1522 2.3837 0.0696 0.3096 0.6204 0.6561 4.8106 4.3668 19.6850 8.9927 1.6243 0.2277 1.8096 14.7520 17.8540 0.0366 8.1462 11.5460 44.6866 61.8780 31.5909 9.5367 9.8665 0.0304 2.8297 2.5458 32.5175 0.3569 0.5879 0.2889 4.4117 2.9528 9.7496 6.2130 0.2135 313.9096 48.1857 0.5211 3.2460 0.5350 3.1433 23.5829 26.4503 29.6584 40.8147 35.3784 17.5587 15.7662 11.5108 5.6378 1.5982 1.7835 163.4569 31.1742 4.1715 23.7214 5.8781 0.2537 7.5193 12.0861 29.7224 14.7271 22.2920
temp: 298.150 k
press: 1.00000 atm
elementType: 8 8 8 6 6 6 6 6 6 6 6 6 6 1 1 1 1 1 1 1 1 1 1
symmnumber: 1
zpe: 462834.3 jmol-1
zpe.correction: 0.176284 hartree
zpe.thermalcorrener: 0.188522 hartree
zpe.thermalcorrenthalpy: 0.189466 hartree
zpe.thermalcorrgfe: 0.135862 hartree
zpe.sumelectzpe: -611.738466 hartree
zpe.sumelectthermal: -611.726229 hartree
zpe.sumelectthermalent: -611.725284 hartree
zpe.sumelectthermalfe: -611.778888 hartree
dipole: 0.2760 0.1425 -3.1893
dipole: 3.2044
quadrupole: -57.7139 -71.7034 -82.2923
quadrupole: 2.2838 5.2233 -0.5040
quadrupole: 12.8560 -1.1335 -11.7224 2.2838 5.2233 -0.5040
hfenergy: -611.9147503 hartree
pointgroup: C01 [X(C10H10O3)]
dipole: -0.1471782 1.0064013 0.7449055 debye
dipolederiv: -0.4681797 0.059957 0.0458955 0.0789007 -0.5791357 -0.0607505 0.1404156 -0.0246604 -0.2535743 -1.1786327 -0.265713 -0.3687127 -0.4106816 -0.4093706 -0.1882399 -0.5464818 -0.2072709 -0.813214 -0.7329109 -0.0610984 0.1883761 -0.1358576 -0.3227952 0.0215215 0.0264894 -0.0906922 -0.8599064 0.6224037 -0.0455006 -0.0430522 -0.1059016 0.2910055 -0.0075437 0.0062232 0.0867915 0.2602089 -0.4270116 -0.0778971 -0.0690285 -0.0804441 0.2103196 0.0401545 -0.1456196 -0.0361478 0.1481996 0.1291341 -0.0278479 0.0212623 -0.0162827 -0.0640181 0.0046112 -0.0245059 -0.0113878 -0.0706998 1.5631804 0.3134597 0.1700763 0.6175687 0.3269608 0.1490054 0.3551188 0.2668968 1.3197847 -0.1250487 -0.061733 0.0168008 -0.0831993 -0.0293549 -0.0737982 -0.0077997 -0.0468081 -0.0790871 -0.131101 0.0342727 -0.0852269 0.0051376 -0.0726954 -0.0936255 -0.0032969 -0.1091509 -0.0114733 -0.0438676 0.0304367 -0.0842352 0.0595135 -0.0410424 -0.1212271 -0.0992562 -0.1196497 0.0121829 -0.0122247 -0.0956863 0.0354236 -0.1061946 -0.0057981 -0.1004019 0.0538484 -0.0982771 -0.0555702 0.0425362 -0.0511325 -0.0642411 -0.0483339 -0.1058438 -0.0346876 -0.0471196 -0.0387882 -0.091212 0.638604 0.1143001 0.1213663 0.1190882 0.3196037 0.0446677 0.0315612 0.0066843 0.2231936 0.0217615 0.0295806 0.0236482 0.0090331 0.054636 0.0713195 0.02974 0.0598175 -0.0200987 0.0467255 -0.0388049 0.0430201 -0.0423065 0.0785702 -0.0201398 0.0555734 -0.0411209 -0.0394765 0.0820063 0.0803546 -0.0416984 0.0704747 0.0507154 0.0779803 -0.0472377 0.0589166 0.0883439 0.0609525 -0.037101 0.0952361 -0.0313439 0.0764056 0.0906347 0.0757406 0.0989645 0.0070943 0.0416819 -0.027453 0.075276 -0.0348156 0.0602785 0.1125958 0.0969828 0.1080378 0.0050066 0.0145972 0.091207 -0.0396999 0.106364 0.0230151 0.1016137 -0.0462538 0.1025683 0.0671519 -0.1075494 0.0500009 0.0663171 0.0510834 0.1189267 0.0232981 0.0698549 0.0229401 0.1061337 0.0312091 -0.035205 -0.0518025 -0.0467352 0.104777 -0.0406489 -0.1012632 -0.0558567 -0.0671203 -0.0152626 0.0059314 -0.0521347 -0.0434274 -0.0514783 0.0685058 0.0343687 0.1274089 0.0444602 -0.0530035 0.0156717 -0.0028663 0.0683601 -0.0336818 -0.0648452 0.0929173 -0.0592157 0.0796725 unknown
polarizability: 168.0773186|-4.2706663|84.5356651|-2.7613006|-16.0174334|95.6945915 unknown
InChI: InChI=1S/C10H10O3/c1-12-10(11)9-8(13-9)7-5-3-2-4-6-7/h2-6,8-9H,1H3
charge 0 multiplicity 1
23 atoms
O  0.728647 -1.568282 -0.459941
O  3.301382 0.543801 0.923533
O  3.02858 0.217589 -1.375294
C  0.093517 -0.247877 -0.824954
C  1.210401 -0.299397 0.195629
C  -1.327554 -0.02364 -0.425848
C  2.582028 0.159639 -0.208147
C  -1.920284 -0.75961 0.631954
C  -2.096737 0.947672 -1.115352
C  -3.259783 -0.515871 1.001394
C  -3.435834 1.194577 -0.740393
C  -4.02011 0.4653 0.320668
C  4.675315 1.045388 0.668341
H  0.390668 0.097799 -1.824737
H  0.968746 -0.214232 1.260528
H  -1.335193 -1.540301 1.131235
H  -1.647656 1.510153 -1.943275
H  -3.714898 -1.093305 1.813718
H  -4.022734 1.947981 -1.277255
H  -5.060545 0.652373 0.60855
H  5.068771 1.303306 1.66094
H  4.641049 1.929113 0.00926
H  5.281226 0.258225 0.189646
