program: Gaussian 09
title: 000086822
version: EM64L-G09RevD.01
frameworkgroup: C1[X(C8H14O3)]
method: RPBEPBE
basis: SDD
operation: Freq
keyword: #pfreq=noraman
keyword: PBEPBE/SDD
title: #p freq=noraman PBEPBE/SDD
converged: YES YES NO NO
title: Mulliken charges:
elementType: O O O C C C C C C C C H H H H H H H H H H H H H H
charge: -0.304373 -0.280201 -0.287158 -0.032342 -0.039571 -0.457920 -0.461005 -0.349524 -0.284629 -0.258802 -0.291960 0.220613 0.243591 0.212547 0.247001 0.226694 0.228012 0.223993 0.220024 0.197105 0.213800 0.198113 0.201501 0.220359 0.194133
chargesum: 0.00000
title: Mulliken charges with hydrogens summed into heavy atoms:
elementType: O O O C C C C C C C C
charge: -0.304373 -0.280201 -0.287158 0.188271 0.204020 0.001627 -0.006300 0.094494 0.126276 0.140811 0.122533
polarizability: 1.20360843e+02 4.65429032e-01 8.04649257e+01 5.02508741e+00 9.24078306e-01 7.95177252e+01
1716.lowfreq: -20.2243 -13.7680 -7.5684 -0.0011 -0.0007 -0.0007 24.0109 27.9956 43.7574
frequency: 23.2269 27.0123 43.0130 67.4626 111.1733 127.9190 205.7440 221.4247 251.1795 344.2505 391.5310 461.5741 474.7919 570.9572 645.7327 746.1933 793.4340 818.6900 849.2474 860.4556 888.1173 891.9640 916.1495 927.6933 965.4018 976.7054 1023.9415 1026.8823 1030.7266 1049.4570 1097.4532 1109.2262 1115.9161 1129.3458 1140.3787 1155.7650 1161.8401 1198.3748 1204.5241 1226.1020 1237.2169 1268.2560 1289.1788 1311.4214 1322.8543 1334.7465 1358.9217 1382.0809 1422.4214 1462.2315 1468.1281 1472.0041 1478.4264 1486.5604 1491.2037 2930.2478 2938.0735 2968.2291 2982.8243 2986.4890 3002.0290 3010.2666 3011.6186 3062.1302 3067.4204 3081.6821 3098.5516 3111.7525 3176.3937
redmass: 3.3549 3.2308 3.4021 3.6308 4.1312 4.0104 3.5252 1.8208 5.6554 3.5642 2.2464 2.8360 3.3930 2.0836 4.1365 7.8444 4.3053 3.3046 1.9491 2.1099 1.6867 1.2691 2.6468 4.6219 1.7376 1.3841 1.9812 1.9010 2.3624 8.2273 1.3710 1.3325 1.4588 1.4737 1.6776 1.6410 1.5137 1.3735 1.3027 1.3147 1.4369 1.1812 1.2748 1.2706 1.2579 1.2891 1.4566 1.6755 1.8181 1.0896 1.1050 1.1653 1.1430 1.1000 1.0928 1.0559 1.0561 1.0665 1.0904 1.1047 1.0903 1.0755 1.0631 1.0980 1.0530 1.1026 1.1021 1.0915 1.1190
irintensity: 0.6835 1.0169 2.8071 1.5126 3.6110 13.2936 16.8249 3.6937 0.7476 4.1115 1.0156 2.4176 2.1405 1.6441 5.0397 7.2505 40.1535 5.2312 7.1191 13.5953 12.0655 4.7299 10.2730 7.8885 2.1796 12.8606 8.9430 19.1569 37.4122 224.1756 6.7932 6.9311 7.8001 1.4410 4.0059 0.7681 7.1098 1.6343 3.6153 4.9319 2.0941 6.6445 2.8755 1.8938 20.8768 8.5486 2.1028 1.0695 0.7419 6.9474 11.6203 8.7984 5.3190 4.0834 2.2186 21.8830 79.4207 92.0715 17.0786 47.5277 29.0742 57.1750 36.4806 42.4996 26.3612 30.6339 44.5920 17.6146 31.2762
temp: 298.150 k
press: 1.00000 atm
elementType: 8 8 8 6 6 6 6 6 6 6 6 1 1 1 1 1 1 1 1 1 1 1 1 1 1
symmnumber: 1
zpe: 553179.2 jmol-1
zpe.correction: 0.210695 hartree
zpe.thermalcorrener: 0.222539 hartree
zpe.thermalcorrenthalpy: 0.223483 hartree
zpe.thermalcorrgfe: 0.169743 hartree
zpe.sumelectzpe: -537.941663 hartree
zpe.sumelectthermal: -537.929818 hartree
zpe.sumelectthermalent: -537.928874 hartree
zpe.sumelectthermalfe: -537.982615 hartree
dipole: -1.9770 1.6413 0.0566
dipole: 2.5701
quadrupole: -74.0509 -66.7000 -64.0386
quadrupole: -2.6301 8.6599 1.0837
quadrupole: -5.7877 1.5631 4.2246 -2.6301 8.6599 1.0837
hfenergy: -538.1523575 hartree
pointgroup: C01 [X(C8H14O3)]
dipole: 0.7761032 -0.6421296 -0.0882737 debye
dipolederiv: -0.6363806 0.0625117 -0.1360801 0.0638125 -0.4300622 0.0695716 -0.1765551 0.0660914 -0.3677783 -0.9783661 -0.0179515 0.1351425 -0.0033077 -0.4680475 -0.024178 0.0954902 -0.0214784 -0.4051628 -1.2940088 -0.0440951 -0.0577721 -0.0750063 -0.4080724 0.0013876 -0.1502693 -0.0057222 -0.4128212 0.5956862 0.0331411 -0.0673301 0.15036 0.3195617 -0.0924956 -0.0015876 -0.0383883 0.3031041 0.2833243 0.0477201 -0.0339517 0.0605149 0.2925883 0.0788219 0.0845287 0.0414941 0.1939941 -0.0669765 0.0549897 0.0137934 -0.0125961 -0.0607807 -0.1156213 0.0149846 -0.0658476 0.0776851 -0.030414 -0.0558628 -0.0255376 0.0018137 -0.0573764 -0.0348473 0.0576819 -0.0713558 0.1327819 0.1119151 0.0173755 0.1357175 0.0594455 0.2723834 -0.0211613 0.0022897 0.0257973 0.2196909 0.7112582 0.1186902 -0.0281243 0.3781133 0.3178568 0.0580719 -0.0447243 0.0435424 0.3649389 0.7970847 -0.0938684 0.0165787 -0.2794803 0.2536327 -0.0621034 0.1728511 -0.0180248 0.4134426 0.6085824 0.0170144 -0.1012122 -0.1690269 0.2396842 0.0383661 -0.2642519 -0.0395784 0.4089308 -0.0218617 -0.0196868 0.0383359 -0.0407376 -0.0163439 0.079668 0.0655688 0.0702804 -0.143885 0.0203435 0.0098282 0.0429968 -0.0104105 -0.0518302 -0.0869846 0.0479534 -0.1049425 0.0200062 0.0420525 0.0247829 -0.0409708 0.0215741 0.0535243 0.0875833 -0.0670366 0.0307058 -0.1313919 0.0388617 -0.1026853 0.003382 -0.0996906 -0.0716311 0.0153519 0.0118101 0.0380865 0.0802512 0.0428387 -0.0016519 -0.0348526 0.0193692 -0.0030406 0.080255 -0.0815746 0.1236827 -0.0892964 -0.0094898 0.0835903 0.0845291 0.0760134 0.027568 -0.0700604 0.1194581 -0.0951027 -0.0346257 0.0528558 -0.0985339 0.0113541 -0.1056267 -0.0832763 0.0723941 0.0273648 0.0426952 0.0256579 0.1215224 -0.0335659 -0.0525775 -0.0340544 -0.003364 -0.0887672 -0.0206603 -0.0447318 -0.0901976 -0.0408384 -0.0301663 0.0151043 -0.0837657 0.0111312 0.0459272 0.0568624 0.1095057 -0.1627219 -0.0466806 0.0632003 0.0481521 -0.0307531 -0.111285 -0.1013542 0.0198858 -0.1267411 -0.0224613 -0.0529357 0.033781 0.0033858 0.1056108 -0.0804604 -0.078143 0.0298723 -0.1375835 -0.0455832 -0.0612969 -0.0307899 0.0629332 0.0321667 0.0084504 0.0949472 -0.0388903 0.1135059 -0.1582879 -0.1766804 -0.0413049 -0.0687442 -0.0253287 0.0625038 -0.0237451 -0.1081388 -0.0457805 0.0023747 -0.0103962 0.0035374 0.0357478 0.0009905 -0.0133138 0.0771156 0.1470868 0.1098905 -0.1786452 unknown
polarizability: 120.4777813|1.2205414|80.7563653|-4.3839052|-0.6548496|79.1093472 unknown
InChI: InChI=1S/C8H14O3/c1-2-7(10-3-1)4-9-5-8-6-11-8/h7-8H,1-6H2
charge 0 multiplicity 1
25 atoms
O  -4.490106 0.15142 -0.498557
O  2.753731 0.964736 0.592314
O  -0.759145 -0.066888 -0.00906
C  1.600175 0.022667 0.483174
C  -3.091557 -0.42061 -0.432355
C  2.059858 -1.112809 -0.458267
C  3.593755 -1.143586 -0.234326
C  -4.011378 -0.582546 0.735565
C  0.401735 0.835447 -0.010957
C  -1.989443 0.61618 -0.425303
C  3.928106 0.35493 -0.085379
H  1.382802 -0.370523 1.496153
H  -2.926115 -1.280288 -1.094123
H  1.829301 -0.849807 -1.508039
H  1.565028 -2.0693 -0.227546
H  3.83528 -1.687079 0.697314
H  4.139447 -1.619216 -1.067325
H  -4.495863 -1.549968 0.912991
H  -3.866151 0.051734 1.619164
H  0.597243 1.223257 -1.034928
H  0.223292 1.698858 0.664628
H  -2.242787 1.441027 0.275617
H  -1.864369 1.051816 -1.441342
H  4.812964 0.553814 0.54332
H  4.068897 0.836035 -1.075133
