program: Gaussian 09
title: 000089189
version: EM64L-G09RevD.01
frameworkgroup: C1[X(C13H25O6PS2)]
method: RPBEPBE
basis: SDD
operation: Freq
keyword: #p
keyword: freq=noraman
keyword: PBEPBE/SDD
title: #p freq=noraman PBEPBE/SDD
converged: YES YES NO NO
title: Mulliken charges:
elementType: S S P O O O O O O C C C C C C C C C C C C C H H H H H H H H H H H H H H H H H H H H H H H H H
charge: 0.045896 -0.232006 0.602847 -0.469908 -0.466517 -0.266244 -0.265807 -0.237041 -0.260260 -0.608222 -0.368670 -0.523495 0.366173 0.289231 -0.216567 -0.219960 -0.223944 -0.231127 -0.678975 -0.656208 -0.675272 -0.671671 0.367726 0.241656 0.247445 0.252935 0.264307 0.221669 0.235307 0.228861 0.256123 0.229199 0.227717 0.229008 0.232621 0.205370 0.228182 0.277198 0.212583 0.225311 0.233634 0.236489 0.228424 0.212451 0.230921 0.228168 0.214443
chargesum: 0.00000
title: Mulliken charges with hydrogens summed into heavy atoms:
elementType: S S P O O O O O O C C C C C C C C C C C C C
charge: 0.045896 -0.232006 0.602847 -0.469908 -0.466517 -0.266244 -0.265807 -0.237041 -0.260260 -0.240496 0.120431 -0.006254 0.366173 0.289231 0.240409 0.265024 0.232972 0.230502 0.031775 0.015319 0.002092 0.001861
polarizability: 2.81135557e+02 -1.57606568e+01 2.17801572e+02 2.64503412e+00 1.74305994e+00 1.91523297e+02
1716.lowfreq: -2.8633 -0.0007 0.0004 0.0011 6.5961 11.2338 13.8549 19.0034 26.2112
frequency: 12.7947 17.7738 26.1163 30.0488 44.4648 52.3624 53.0892 62.3030 65.1329 70.4644 74.9719 84.2986 86.2761 93.1894 105.2320 120.4385 125.9637 134.5061 143.9737 155.3108 178.8090 200.6994 208.1857 232.9720 247.2147 250.3858 254.4592 256.9937 262.3992 280.9717 291.8433 301.8169 319.0822 327.3549 342.2294 363.9896 391.2193 411.9911 434.0714 470.9465 545.8334 548.0933 626.4740 652.3500 673.5295 689.9668 710.9447 742.9422 795.2646 799.3072 800.7611 813.4234 817.2276 817.6076 859.7212 864.8946 871.0011 883.9281 906.9146 981.8232 1014.4654 1017.1771 1021.7388 1025.1948 1038.4347 1085.2101 1102.6906 1106.2397 1109.3288 1113.2079 1116.8849 1131.8732 1134.7653 1136.7183 1137.6324 1141.6310 1189.0400 1206.2315 1246.9893 1249.1662 1258.0778 1266.6512 1270.4461 1313.5041 1341.2543 1344.5911 1354.5816 1356.1161 1366.2486 1367.5203 1392.1688 1400.4717 1400.7879 1401.7312 1439.1511 1454.2577 1456.0969 1462.6282 1463.8362 1464.9420 1470.8677 1473.1832 1476.4731 1476.9319 1485.8700 1486.0684 1486.6479 1492.7268 1630.8952 1641.5542 2984.7430 2989.0330 2993.6493 2994.2033 2995.6206 2996.0876 3001.5716 3008.3511 3010.9324 3015.0086 3054.1046 3058.4195 3065.6818 3066.7607 3069.8967 3076.1045 3085.9343 3087.9960 3090.9183 3091.6655 3093.0105 3105.6798 3107.3348 3109.0359 3114.7840
redmass: 3.9003 4.3850 5.0493 3.9926 3.4546 2.8250 3.6018 2.3456 3.8125 4.8526 4.5526 2.9728 4.7860 3.2880 2.1580 5.2473 4.7456 3.3583 3.1957 4.6492 3.2279 2.8633 2.5225 1.5629 1.3276 2.1322 2.2548 1.8378 1.9950 3.0786 4.6207 5.5194 5.2476 5.6632 3.7572 3.2883 4.1012 8.1449 5.7892 4.2142 3.3091 9.0316 3.5932 5.8482 6.1338 5.0700 7.9592 4.9024 2.9856 1.1039 1.1451 3.4592 1.1083 1.1098 4.6107 3.1777 5.1085 3.6165 3.1498 2.4414 2.3249 2.2403 2.2951 2.8033 3.1373 4.1520 2.2860 2.9486 2.2068 2.2490 2.4561 1.8361 1.4791 1.6851 1.4121 1.4600 1.3527 1.2624 1.1421 1.1373 1.1458 1.1766 1.1198 1.4280 1.3181 1.3208 1.2572 1.4193 1.5570 1.2399 1.2539 1.2372 1.2466 1.2689 1.0886 1.0412 1.0874 1.0400 1.0402 1.0410 1.0599 1.0608 1.0573 1.0719 1.0686 1.0785 1.0656 1.0579 9.5063 9.6293 1.0556 1.0555 1.0383 1.0357 1.0371 1.0358 1.0637 1.0579 1.0582 1.0618 1.1073 1.1078 1.0966 1.1062 1.1065 1.0883 1.0972 1.0972 1.0981 1.0990 1.0986 1.1024 1.1027 1.1021 1.1025
irintensity: 0.0455 0.2301 0.5491 0.3570 0.4047 0.2008 0.1699 2.6096 1.6870 1.3151 1.0773 1.2313 0.4895 2.4973 3.5418 5.3362 1.5265 1.3519 4.3934 1.0147 5.1589 1.3537 8.6872 0.6553 0.1025 3.1589 6.8795 2.6154 2.1593 9.2702 5.3306 7.0420 1.5209 17.5448 2.3091 5.7550 1.8661 57.1019 4.4475 6.8062 18.3316 125.8749 2.3487 2.8374 49.2525 7.4090 91.8040 9.5505 11.3567 3.2641 4.5302 2.0803 8.8131 3.8478 266.7346 9.3048 17.6202 19.3510 17.1160 9.4868 167.1586 17.2307 41.0106 11.3742 118.7769 21.7688 11.4399 156.9162 7.3002 10.3370 77.3089 209.9862 12.8656 127.5400 3.7300 7.5383 96.4823 22.4662 0.0711 0.1308 0.2327 16.6468 0.3591 20.0009 5.8812 29.4331 10.4009 1.4499 19.1835 1.6293 26.1988 5.4728 37.4883 24.6856 30.0046 10.5800 19.8969 15.3453 8.1912 10.5032 3.8979 2.5401 0.8497 7.6699 16.9507 14.8357 13.4730 8.9904 178.0932 143.2460 20.5794 21.6771 27.4833 20.7659 22.7648 20.5860 13.0495 19.7330 14.3287 18.9546 18.1261 4.3357 4.4072 8.1608 7.0188 11.6499 2.1312 24.5890 32.4744 30.1682 26.8897 33.6293 49.2884 30.8946 11.4819
temp: 298.150 k
press: 1.00000 atm
elementType: 16 16 15 8 8 8 8 8 8 6 6 6 6 6 6 6 6 6 6 6 6 6 1 1 1 1 1 1 1 1 1 1 1 1 1 1 1 1 1 1 1 1 1 1 1 1 1
symmnumber: 1
zpe: 982587.4 jmol-1
zpe.correction: 0.374248 hartree
zpe.thermalcorrener: 0.403847 hartree
zpe.thermalcorrenthalpy: 0.404791 hartree
zpe.thermalcorrgfe: 0.308757 hartree
zpe.sumelectzpe: -2097.309629 hartree
zpe.sumelectthermal: -2097.280030 hartree
zpe.sumelectthermalent: -2097.279086 hartree
zpe.sumelectthermalfe: -2097.375120 hartree
dipole: -6.3779 1.4792 -1.3572
dipole: 6.6864
quadrupole: -151.2472 -144.9925 -153.7743
quadrupole: 6.6560 -0.6967 -3.9638
quadrupole: -1.2426 5.0122 -3.7696 6.6560 -0.6967 -3.9638
hfenergy: -2097.6838766 hartree
pointgroup: C01 [X(C13H25O6P1S2)]
dipole: -2.2641166 -1.0804261 0.7915921 debye
polarizability: 269.8094446|27.5081019|227.9101822|-10.8322318|-4.2128328|192.7407992 unknown
InChI: InChI=1S/C9H15O4S.C4H10O2PS/c1-3-12-8(10)6-5-7(14)9(11)13-4-2;1-3-5-7(8)6-4-2/h7H,3-6H2,1-2H3;3-4H2,1-2H3
charge 0 multiplicity 1
47 atoms
S  1.722524 0.818941 -2.092475
S  4.429648 2.654968 -0.475143
P  2.783489 1.45563 -0.149226
O  1.488084 2.028062 0.848011
O  2.974411 -0.023368 0.734693
O  -0.266057 -1.738668 0.28589
O  -3.869377 -0.377677 -0.010177
O  1.351202 -2.248677 -1.313886
O  -2.431528 1.430616 -0.288201
C  0.21491 -0.021816 -1.286764
C  -0.932773 0.004821 -2.334333
C  -2.276842 -0.531809 -1.795962
C  0.542006 -1.437366 -0.813199
C  -2.827386 0.29381 -0.641691
C  1.021513 3.433621 0.622327
C  4.051836 -0.954133 0.268899
C  -0.103635 -3.101207 0.882309
C  -4.511994 0.33272 1.142259
C  -0.241508 3.594867 1.461969
C  4.21722 -1.991196 1.374587
C  -1.16049 -3.2285 1.974418
C  -5.587253 -0.599781 1.688967
H  -0.063079 0.592835 -0.41584
H  -0.638984 -0.584535 -3.222672
H  -1.06182 1.054807 -2.651699
H  -3.026736 -0.51135 -2.611206
H  -2.207509 -1.582313 -1.466325
H  0.814938 3.578264 -0.456391
H  1.829969 4.120781 0.93332
H  4.981241 -0.374568 0.107179
H  3.722836 -1.413893 -0.681486
H  0.925781 -3.174985 1.277882
H  -0.221135 -3.852604 0.080395
H  -4.925582 1.288182 0.771808
H  -3.726958 0.560661 1.885458
H  -0.602883 4.637495 1.382309
H  -0.030265 3.381176 2.523671
H  -1.037482 2.920548 1.105461
H  4.997819 -2.718535 1.084171
H  3.275481 -2.54325 1.535561
H  4.513977 -1.512855 2.322985
H  -1.014261 -2.459484 2.751799
H  -2.175044 -3.112712 1.554733
H  -1.089946 -4.223607 2.450147
H  -6.344069 -0.825645 0.918546
H  -5.146015 -1.550733 2.033669
H  -6.095573 -0.121937 2.546153
