program: Gaussian 09
title: 000086787
version: EM64L-G09RevD.01
frameworkgroup: C1[X(C14H28O3S)]
method: RPBEPBE
basis: SDD
operation: Freq
keyword: #p
keyword: freq=noraman
keyword: PBEPBE/SDD
title: #p freq=noraman PBEPBE/SDD
converged: YES YES NO NO
title: Mulliken charges:
elementType: S O O O C C C C C C C C C C C C C C H H H H H H H H H H H H H H H H H H H H H H H H H H H H
charge: 0.961930 -0.280921 -0.570434 -0.558474 -0.024150 -0.598967 -0.425238 -0.565863 -0.281036 -0.406985 -0.379295 -0.374697 -0.383152 -0.381866 -0.372986 -0.353293 -0.356617 -0.697479 0.237487 0.278514 0.288006 0.264485 0.233825 0.284515 0.295756 0.213605 0.180781 0.195139 0.217432 0.251112 0.175144 0.182152 0.192429 0.216201 0.186018 0.191419 0.186362 0.195666 0.187491 0.187525 0.185033 0.196888 0.194128 0.209518 0.208430 0.214462
chargesum: 0.00000
title: Mulliken charges with hydrogens summed into heavy atoms:
elementType: S O O O C C C C C C C C C C C C C C
charge: 0.961930 -0.280921 -0.570434 -0.558474 0.213338 -0.032448 0.073072 0.014408 0.113350 0.005586 0.046961 -0.000116 0.019067 -0.004084 0.010171 0.019265 0.034398 -0.065069
polarizability: 2.21615093e+02 -2.94605844e+00 1.84168610e+02 -9.60706789e-02 2.35912273e+00 1.52832360e+02
1716.lowfreq: -18.1301 -11.5382 -0.0020 -0.0009 0.0010 1.4054 6.7113 15.5432 15.8309
frequency: -8.7939 14.8786 15.2886 38.0329 44.9102 56.1888 74.6992 81.9063 104.4209 109.7783 120.1796 133.7803 150.2214 158.0535 185.6536 196.5459 212.5447 226.5082 232.8328 260.0825 274.9280 280.9906 317.5121 339.8359 365.1303 391.6303 439.4416 462.5677 466.6706 518.8501 525.4596 538.4133 668.3350 719.1739 723.3892 731.7088 753.6628 784.8473 801.7427 813.2098 840.9037 848.3123 866.9067 870.7785 885.9253 892.2069 921.6452 943.7610 954.8001 975.6097 984.2555 993.0197 1014.2839 1018.5184 1033.1739 1059.4751 1063.3511 1076.4899 1078.9633 1082.1360 1087.2255 1093.5932 1116.5097 1124.2707 1147.9639 1158.3326 1178.0206 1184.6450 1199.5038 1217.2008 1227.1331 1248.1204 1250.9085 1257.0930 1267.9602 1276.7473 1279.2338 1286.0864 1289.5946 1290.5766 1293.2882 1303.0963 1321.6307 1329.7759 1341.3801 1351.3934 1355.0336 1366.0043 1369.1267 1385.8796 1400.3006 1408.0752 1438.0153 1447.8219 1460.7619 1461.2509 1464.6591 1468.7088 1475.3366 1475.6274 1478.6862 1481.7389 1487.3040 1489.9393 2936.6179 2944.5960 2947.5364 2949.2847 2951.0642 2955.3805 2961.6547 2962.6547 2967.3235 2969.9986 2974.3758 2982.4015 2987.8711 2993.7716 2999.3011 3009.9552 3020.3086 3022.9492 3028.3147 3038.5944 3048.8824 3061.4152 3066.7336 3068.6423 3076.3868 3091.8049 3160.6536 3178.6321
redmass: 1.8261 3.8435 4.2793 3.6545 4.6607 5.4194 1.7182 3.0850 3.2734 3.7429 1.9817 2.2447 2.1693 2.9073 7.0770 2.8749 3.3299 1.1166 2.9719 2.7966 5.1325 5.3151 3.2417 2.3922 2.7032 3.0703 3.4196 3.7302 3.6883 2.8969 5.4460 5.1491 2.4134 1.0599 1.0818 1.1589 1.2476 1.7678 5.6946 1.5508 2.1312 2.1439 1.7820 2.8218 1.8308 1.6137 2.4359 1.6246 1.5405 2.0877 2.4210 2.7734 2.0581 1.5068 3.6769 2.1176 1.9313 2.3110 2.2496 2.0970 1.7781 1.2750 1.6403 2.6805 1.8145 1.4566 1.4232 1.7218 1.2599 1.4061 1.3080 1.2342 1.3127 1.2750 1.4287 1.1806 1.0771 1.1973 1.1164 1.2530 1.1531 1.1540 1.3338 1.3515 1.4640 1.6672 1.6128 1.5869 1.3403 1.2165 1.1074 1.1047 1.0961 1.0818 1.0714 1.0717 1.0663 1.0788 1.0728 1.0481 1.0815 1.0836 1.0875 1.0977 1.0568 1.0592 1.0589 1.0590 1.0638 1.0602 1.0612 1.0833 1.0586 1.0369 1.0659 1.0950 1.0958 1.0996 1.1013 1.1019 1.0989 1.0608 1.1034 1.1043 1.1027 1.0562 1.1007 1.0993 1.0574 1.1017 1.1114 1.1131
irintensity: 0.0941 2.7000 0.7959 0.2441 1.7260 7.3484 0.1210 1.1496 1.2681 2.3506 0.1040 0.7509 0.3683 2.1559 1.3658 0.0926 1.3565 0.0068 1.5891 3.8448 8.6889 14.3487 5.2314 1.8040 2.1007 11.2138 1.0596 1.7380 1.6725 2.2288 25.9290 19.3702 1.8944 15.3767 0.1659 2.6039 1.8212 4.6413 64.2089 10.7958 7.9140 12.8357 0.9563 1.9809 4.2973 4.5648 33.3804 11.6014 28.2075 75.7409 2.8008 30.4398 0.4616 25.9939 25.5884 27.3090 5.1137 6.8282 19.6734 1.0494 7.8091 6.6037 5.1234 5.9993 6.4321 17.3566 14.5671 2.9708 11.4664 4.3425 1.6996 1.4995 0.4323 0.1401 1.0899 0.0205 0.9210 1.6456 3.3041 33.7306 10.4314 0.3313 0.7057 5.9448 0.0092 0.6251 0.6938 0.7926 5.6060 11.1674 19.7631 10.1180 13.1016 6.1448 0.1030 0.0987 0.2206 0.2228 4.2563 9.8633 10.4054 1.1425 6.5883 30.0956 34.1042 5.3058 5.2721 4.8788 21.5926 1.2099 55.7754 55.9318 150.9186 34.9081 24.3852 7.4214 6.2943 3.1086 87.8376 3.1084 5.0139 22.5940 6.4860 91.3258 129.7980 3.3743 100.0092 55.7403 2.5562 6.3255 0.6716 0.5709
temp: 298.150 k
press: 1.00000 atm
elementType: 16 8 8 8 6 6 6 6 6 6 6 6 6 6 6 6 6 6 1 1 1 1 1 1 1 1 1 1 1 1 1 1 1 1 1 1 1 1 1 1 1 1 1 1 1 1
symmnumber: 1
zpe: 1047517.1 jmol-1
zpe.correction: 0.398978 hartree
zpe.thermalcorrener: 0.420852 hartree
zpe.thermalcorrenthalpy: 0.421796 hartree
zpe.thermalcorrgfe: 0.344656 hartree
zpe.sumelectzpe: -1172.360291 hartree
zpe.sumelectthermal: -1172.338417 hartree
zpe.sumelectthermalent: -1172.337473 hartree
zpe.sumelectthermalfe: -1172.414613 hartree
dipole: -3.6111 5.7041 0.3785
dipole: 6.7616
quadrupole: -103.2259 -135.6298 -115.5002
quadrupole: -15.2476 -3.1776 -8.3416
quadrupole: 14.8927 -17.5112 2.6185 -15.2476 -3.1776 -8.3416
hfenergy: -1172.7592693 hartree
pointgroup: C01 [X(C14H28O3S1)]
dipole: -1.3330109 2.300959 -0.0742064 debye
polarizability: 221.3017249|-4.4231175|184.5902963|-1.2981332|-1.0959993|152.7240419 unknown
InChI: InChI=1S/C14H28O3S/c1-2-3-4-5-6-7-8-9-11-17-14-10-12-18(15,16)13-14/h14H,2-13H2,1H3
charge 0 multiplicity 1
46 atoms
S  -3.004601 -1.757336 0.190122
O  -2.99975 1.546214 0.413738
O  -3.872944 -3.116753 -0.096495
O  -1.36883 -1.798393 0.214234
C  -4.136727 0.756484 -0.065038
C  -3.669037 -0.355254 -1.015826
C  -4.745595 0.10673 1.208758
C  -3.723398 -0.87623 1.78481
C  -2.456423 2.529957 -0.550479
C  -0.984559 2.765505 -0.192569
C  -0.081902 1.555374 -0.520842
C  1.374115 1.733194 -0.037089
C  2.273794 0.530753 -0.402502
C  3.724157 0.672099 0.11056
C  4.625987 -0.522305 -0.275755
C  6.078719 -0.384782 0.232614
C  6.980522 -1.57692 -0.162369
C  8.431596 -1.430546 0.344667
H  -4.888975 1.399976 -0.568886
H  -2.810091 -0.088541 -1.646724
H  -4.477086 -0.84414 -1.580604
H  -4.969794 0.902174 1.93918
H  -5.686125 -0.41209 0.948545
H  -4.134343 -1.693901 2.392095
H  -2.852967 -0.385904 2.240941
H  -3.05406 3.461951 -0.472048
H  -2.542569 2.143207 -1.589317
H  -0.629455 3.664674 -0.736686
H  -0.924504 3.002596 0.888136
H  -0.506058 0.63862 -0.06687
H  -0.079625 1.39167 -1.620343
H  1.805046 2.662137 -0.468398
H  1.377097 1.86992 1.064836
H  1.82322 -0.396671 0.006277
H  2.286979 0.407026 -1.505963
H  3.713506 0.779847 1.215675
H  4.167084 1.609257 -0.288668
H  4.183708 -1.458499 0.124204
H  4.633801 -0.631467 -1.380764
H  6.073574 -0.281756 1.338231
H  6.519971 0.55394 -0.164245
H  6.539897 -2.513619 0.236178
H  6.981863 -1.680906 -1.266864
H  8.459954 -1.357113 1.448442
H  8.902769 -0.516167 -0.063417
H  9.055359 -2.293911 0.047521
