program: Gaussian 09
title: 000086733
version: EM64L-G09RevD.01
frameworkgroup: C1[X(C8H16O2)]
method: RPBEPBE
basis: SDD
operation: Freq
keyword: #pfreq=noraman
keyword: PBEPBE/SDD
title: #p freq=noraman PBEPBE/SDD
converged: YES YES NO NO
title: Mulliken charges:
elementType: O O C C C C C C C C H H H H H H H H H H H H H H H H
charge: -0.287350 -0.261494 0.014217 -0.427329 -0.019621 -0.027101 -0.338475 -0.725439 -0.695915 -0.692058 0.210512 0.224570 0.216815 0.198952 0.226383 0.196873 0.232671 0.212023 0.213924 0.214716 0.239174 0.196033 0.209429 0.219972 0.239267 0.209251
chargesum: 0.00000
title: Mulliken charges with hydrogens summed into heavy atoms:
elementType: O O C C C C C C C C
charge: -0.287350 -0.261494 0.224729 0.014056 0.179331 0.199282 0.091069 -0.084777 -0.051279 -0.023568
polarizability: 1.12072363e+02 2.07695273e+00 8.50618668e+01 7.68817130e-01 -7.89667771e-03 7.90444471e+01
1716.lowfreq: -12.0626 -0.0003 0.0006 0.0008 2.2004 8.1503 21.5562 29.5811 97.9444
frequency: 20.9129 29.2141 97.8456 143.9540 174.9655 219.5087 222.7603 242.1083 245.5450 334.2481 351.4891 384.4661 410.2857 466.4252 525.0817 613.1204 670.7583 760.7129 790.2995 811.2507 877.5079 896.5879 914.0802 934.6688 943.0161 966.5891 968.8590 980.2305 1053.9595 1068.5481 1114.1209 1124.0280 1135.9769 1153.6682 1193.6812 1199.2312 1243.4087 1270.0183 1288.6014 1306.6448 1316.4086 1327.7566 1344.0143 1350.6661 1380.3609 1388.3924 1392.7395 1400.3796 1443.3065 1459.4608 1466.6469 1467.3785 1471.9705 1477.0365 1486.1721 1489.8512 2934.9028 2958.8709 2961.5833 2970.3011 2978.6444 2981.6192 2998.0518 3013.0779 3057.8182 3064.5786 3067.6087 3071.1144 3076.0387 3087.8802 3095.9056 3102.0173
redmass: 3.1264 3.5148 2.7422 3.2542 2.4318 1.4886 1.1715 1.5260 1.1365 2.5880 2.1841 2.1457 2.4138 2.9148 2.5331 3.6418 7.0899 2.9624 3.2128 3.2653 2.5065 2.2219 1.3733 1.4327 1.6361 1.9551 2.2157 3.0397 2.4881 2.0473 1.6239 2.0585 1.9624 2.1828 1.3320 1.7817 1.2062 1.1939 1.3928 1.1759 1.3900 1.4679 1.3332 1.3534 1.2142 1.2338 1.5316 1.2354 1.0902 1.0511 1.0442 1.0776 1.0532 1.0598 1.0468 1.0553 1.0836 1.0688 1.0813 1.0357 1.0366 1.0370 1.0617 1.0866 1.1013 1.0996 1.0994 1.0991 1.0981 1.0992 1.0986 1.0988
irintensity: 0.0649 2.0599 0.3376 2.9655 4.9446 1.7524 0.5036 0.6273 1.0852 0.6410 1.2153 1.1145 2.5504 8.4421 6.9105 0.6025 1.8613 24.4375 4.6858 16.3405 8.4876 62.7178 11.6862 12.3228 5.8267 7.4029 10.9816 75.5189 46.7275 43.1841 1.5363 10.6293 13.7782 12.2743 15.6518 4.2455 1.0119 0.7025 5.1300 3.1936 12.4542 4.6343 3.5845 5.3631 21.3529 25.5400 13.4086 15.8437 7.1710 7.3948 1.7591 9.3132 5.6958 8.0282 18.8798 16.6999 59.8438 67.9821 21.8509 42.9661 37.5575 26.8505 23.6547 32.6742 11.7072 50.4665 27.8531 72.6814 31.1490 44.3549 22.4143 41.8081
temp: 298.150 k
press: 1.00000 atm
elementType: 8 8 6 6 6 6 6 6 6 6 1 1 1 1 1 1 1 1 1 1 1 1 1 1 1 1
symmnumber: 1
zpe: 599514.1 jmol-1
zpe.correction: 0.228343 hartree
zpe.thermalcorrener: 0.240062 hartree
zpe.thermalcorrenthalpy: 0.241006 hartree
zpe.thermalcorrgfe: 0.189577 hartree
zpe.sumelectzpe: -464.042799 hartree
zpe.sumelectthermal: -464.031080 hartree
zpe.sumelectthermalent: -464.030136 hartree
zpe.sumelectthermalfe: -464.081565 hartree
dipole: 1.2158 0.2200 1.0049
dipole: 1.5926
quadrupole: -55.2801 -65.4161 -62.7487
quadrupole: 4.7856 2.1804 -1.0446
quadrupole: 5.8682 -4.2678 -1.6004 4.7856 2.1804 -1.0446
hfenergy: -464.2711419 hartree
pointgroup: C01 [X(C8H16O2)]
dipole: -0.4814511 0.1462766 -0.3733463 debye
dipolederiv: -1.1901348 -0.0759006 0.0556233 0.0935461 -0.4897265 0.0125636 0.0709716 -0.0043516 -0.3780456 -0.8115815 0.1516315 -0.065516 0.1086846 -0.6906798 0.0608243 0.0467324 0.0457282 -0.3867889 1.027798 -0.0416058 -0.0766609 -0.0385777 0.7300484 -0.0251772 -0.1928594 0.0337249 0.5341371 -0.0877604 0.0226234 -0.0235997 0.0209906 0.0332018 0.0119541 -0.0291298 0.030233 0.0145147 0.2287301 -0.0157571 -0.001061 0.0085797 0.1560458 -0.0000738 -0.0423341 0.0137592 0.1465736 0.6878308 -0.0102356 0.0079809 -0.2631634 0.2253553 0.0847774 0.0497101 0.1199517 0.3036921 0.4568095 -0.1701632 0.0853645 -0.0459978 0.1706921 0.0268781 0.0759339 -0.0495709 0.3739905 0.0243505 -0.0089682 0.048071 -0.0339817 0.032082 -0.0629179 0.0607734 -0.0514554 -0.0640944 0.0329041 -0.0183848 0.0014624 -0.0315106 -0.0925473 -0.0101776 0.0323164 -0.0179375 0.0393872 -0.1016929 -0.054191 -0.0811524 -0.0739972 0.0246142 -0.0561299 -0.0977281 -0.0379933 -0.0244787 -0.0245342 -0.0072024 -0.0030657 0.0302366 -0.0412728 -0.0077823 0.0986152 -0.0658508 -0.2180141 0.027626 0.0192293 0.0408301 0.0126556 0.074089 -0.096278 0.0285946 -0.0516158 -0.1128329 0.0306716 -0.0186742 -0.001471 -0.0210084 -0.1425534 0.0249915 -0.0212106 -0.0125407 0.0953582 -0.1163186 0.076874 -0.0977473 0.0746022 -0.0254477 0.0687923 -0.0921877 0.0682419 -0.0659212 -0.068183 0.0145318 0.045024 0.049434 0.0250934 -0.0403116 0.0944735 -0.0489674 -0.1469469 -0.0350269 0.0267012 -0.0352102 -0.011079 0.061449 -0.0255472 -0.1064095 0.0612644 -0.1957354 0.0263307 0.0710964 0.0115787 0.0890873 -0.0709194 -0.0420335 0.0284551 -0.0896615 0.0550517 0.0087589 0.0707001 -0.1221593 0.0917187 0.0166292 0.0869701 -0.0972034 0.0503258 -0.0349473 0.0970122 -0.0741789 -0.0138551 -0.0454519 -0.1840694 -0.0531722 -0.0081661 -0.0143832 0.0568302 -0.1926416 -0.0150687 0.1060841 -0.0516326 0.0930063 0.0134167 0.0675417 0.0006961 0.0470009 0.0565514 0.0837476 -0.0873741 0.063722 0.0243938 0.0392497 -0.105554 0.0704617 0.0069789 -0.1950388 -0.0947408 0.074753 -0.0514038 0.0479315 0.0156402 0.1006435 0.0321018 0.0658196 0.106136 0.0153625 0.0406836 0.0085391 0.0219129 -0.0709179 0.0081067 -0.1123288 -0.1523582 0.0448326 0.0183394 0.1084888 -0.0088544 0.0844896 -0.0248466 0.0505125 -0.0462056 -0.1075645 0.0579126 -0.066814 0.0143171 -0.1211145 -0.07056 0.058412 0.0235579 0.0822339 0.0581159 -0.0913423 0.1010482 -0.031389 0.1459763 -0.0132582 0.0108956 -0.0441558 -0.0058601 0.0902775 unknown
polarizability: 112.1284977|-1.8047082|84.8297111|0.2919794|1.0303412|79.2204681 unknown
InChI: InChI=1S/C8H16O2/c1-6(2)4-8-9-5-7(3)10-8/h6-8H,4-5H2,1-3H3
charge 0 multiplicity 1
26 atoms
O  -1.280856 -0.895882 0.629294
O  -0.346731 1.218813 0.243736
C  -0.07309 -0.218527 0.098028
C  1.140859 -0.651254 0.910455
C  2.532725 -0.237772 0.352219
C  -2.43055 0.045662 0.471968
C  -1.777687 1.341133 -0.094954
C  2.780684 -0.774189 -1.080337
C  2.778045 1.28871 0.424792
C  -3.506217 -0.560524 -0.43438
H  0.014033 -0.462021 -0.984465
H  1.007091 -0.258922 1.936034
H  1.091465 -1.755973 0.973904
H  3.274785 -0.727133 1.018355
H  -2.828924 0.215769 1.489528
H  -1.911464 1.395886 -1.196429
H  -2.143719 2.266555 0.375099
H  2.15438 -0.246928 -1.82419
H  2.561736 -1.856492 -1.15351
H  3.835705 -0.620286 -1.373569
H  2.048328 1.837516 -0.195709
H  3.797568 1.53495 0.072687
H  2.672058 1.658954 1.461184
H  -3.096644 -0.773446 -1.438219
H  -3.884173 -1.505585 -0.008811
H  -4.361008 0.134586 -0.543211
