program: Gaussian 09
title: 000086735
version: EM64L-G09RevD.01
frameworkgroup: C1[X(C15H32)]
method: RPBEPBE
basis: SDD
operation: Freq
keyword: #p
keyword: freq=noraman
keyword: PBEPBE/SDD
title: #p freq=noraman PBEPBE/SDD
converged: YES YES NO NO
title: Mulliken charges:
elementType: C C C C C C C C C C C C C C C H H H H H H H H H H H H H H H H H H H H H H H H H H H H H H H H
charge: -0.404404 -0.003165 -0.394455 -0.381598 -0.387926 -0.385144 -0.385720 -0.381512 -0.391404 -0.373179 -0.744328 -0.353087 -0.715998 -0.356822 -0.696738 0.195351 0.187316 0.190867 0.203207 0.190352 0.191204 0.191498 0.193848 0.192332 0.192604 0.194002 0.192189 0.193751 0.192284 0.191119 0.191813 0.208596 0.188763 0.189742 0.211979 0.211134 0.211265 0.187784 0.187161 0.219438 0.212446 0.220175 0.194455 0.194890 0.209569 0.214743 0.209603
chargesum: 0.00000
title: Mulliken charges with hydrogens summed into heavy atoms:
elementType: C C C C C C C C C C C C C C C
charge: -0.021737 0.187702 -0.000896 0.001104 -0.001746 0.001462 0.000220 0.001891 0.009005 0.005326 -0.109951 0.021858 -0.063939 0.032523 -0.062823
polarizability: 2.11408406e+02 -1.04474415e+00 1.44514408e+02 -2.22196652e-01 -1.61146538e+00 1.39310869e+02
1716.lowfreq: -24.0795 -3.8437 -3.3815 -0.0014 -0.0012 0.0014 10.9298 24.1855 27.4687
frequency: 10.4144 23.7239 27.4141 42.2458 55.5702 70.6265 75.9895 94.1046 102.3349 123.2687 134.6101 144.0396 146.0416 156.6519 160.7843 213.2897 226.2309 231.3179 244.7395 273.6827 299.4705 321.2794 378.6536 405.5610 447.1705 478.6586 501.9355 525.9579 716.7220 719.7632 724.1350 734.4393 750.2520 772.2869 777.6682 810.4274 857.8394 887.2177 902.9963 915.5361 962.0073 969.4922 980.4191 985.4095 994.1381 1012.1807 1014.0638 1022.8773 1037.7299 1046.8133 1059.3174 1073.5901 1077.8429 1080.3110 1082.8077 1118.8037 1144.0710 1147.6091 1172.8360 1183.0461 1205.0404 1205.8766 1231.8398 1233.5334 1255.7869 1258.5244 1269.9205 1275.3839 1276.7626 1282.1583 1284.2145 1287.2281 1292.0144 1293.0927 1305.9971 1319.7597 1326.9710 1341.2757 1350.1620 1352.0840 1353.3671 1354.7331 1356.2921 1383.5497 1388.2316 1391.6660 1457.9233 1458.5278 1460.3080 1461.7560 1463.0446 1466.0865 1467.3603 1470.9311 1475.8814 1476.4796 1478.1857 1480.9606 1483.6453 1485.5291 1488.1925 1489.3693 1491.8872 2940.8289 2947.2068 2947.4157 2948.9289 2949.4647 2951.0615 2952.6060 2955.8643 2960.1076 2963.7303 2967.4731 2968.3069 2970.6034 2973.7633 2980.3651 2981.8513 2982.7905 2986.8980 2992.2587 2998.6298 3007.0642 3017.0299 3017.7861 3027.3814 3035.8555 3042.0125 3062.6274 3064.1098 3067.2779 3069.2925 3071.1508 3077.2069
redmass: 2.5128 2.2595 3.4222 3.3984 1.5542 3.0529 3.2618 1.8971 2.0556 2.0930 1.8226 2.5905 2.0487 2.0933 3.3803 1.2455 1.1229 2.0633 1.3723 2.3977 2.6424 2.9225 2.4841 2.7155 2.9398 2.8629 2.9118 2.1064 1.0620 1.0698 1.0987 1.1927 1.4661 1.3878 1.3076 1.2384 1.2389 1.9058 1.5590 1.3623 1.2670 2.8093 1.4029 3.4150 2.8448 1.9762 1.2284 2.4893 1.2766 2.4847 2.7954 2.6860 2.2508 2.1427 2.2180 2.4106 2.0103 2.0772 1.8994 1.8479 1.4172 1.4805 1.4106 1.3172 1.3163 1.2791 1.1417 1.1292 1.0848 1.2127 1.0956 1.1552 1.1103 1.1184 1.3560 1.4947 1.3949 1.4764 1.4405 1.6397 1.5476 1.6654 1.6162 1.2347 1.2174 1.2116 1.0738 1.0736 1.0706 1.0713 1.0655 1.0810 1.0564 1.0819 1.0783 1.0449 1.0572 1.0817 1.0660 1.0883 1.0922 1.0502 1.0691 1.0799 1.0587 1.0586 1.0591 1.0591 1.0595 1.0596 1.0596 1.0594 1.0584 1.0580 1.0379 1.0368 1.0588 1.0959 1.0398 1.0963 1.0976 1.0991 1.1015 1.1035 1.1030 1.1016 1.1048 1.1047 1.1044 1.0992 1.0994 1.1007 1.0993 1.0986 1.0997
irintensity: 0.0017 0.0015 0.0053 0.0020 0.0016 0.0019 0.0033 0.0010 0.0019 0.0022 0.0015 0.0140 0.0014 0.0197 0.0002 0.0317 0.0008 0.0498 0.0108 0.0443 0.1555 0.1315 0.1261 0.0052 0.1761 0.2297 0.1996 3.7001 14.7606 3.7864 5.9065 0.9107 2.6127 0.8629 8.2278 0.5661 0.5525 5.0734 1.4400 0.2108 0.3210 2.1075 0.6500 0.6295 2.0176 1.6355 2.8033 3.8978 0.6034 0.6820 1.4755 3.0313 0.1964 0.0466 0.7058 15.5094 2.8896 3.1411 6.5394 0.6656 7.5546 4.6653 0.0192 0.4235 0.0748 0.3628 1.4026 0.1594 0.4680 0.3985 0.2014 0.0817 0.0909 0.1923 0.4784 0.7344 0.9746 1.6364 0.6998 0.1647 1.0778 0.4709 2.2483 13.5892 11.3076 20.6508 0.2041 0.0510 0.5284 0.2841 0.1734 0.7268 4.5102 1.3829 1.8009 12.2734 6.5273 4.5815 18.0365 12.0987 33.7498 6.1365 2.1609 16.9866 0.0319 0.0254 0.0968 0.4691 0.9329 0.2580 3.8455 1.4332 134.6430 179.7717 86.6537 36.0705 63.7267 0.2916 17.2700 1.5185 2.6992 4.4357 3.7868 3.2900 15.0493 20.0288 14.2996 0.9911 325.8342 74.3942 36.6959 101.0958 55.4192 56.3699 67.3910
temp: 298.150 k
press: 1.00000 atm
elementType: 6 6 6 6 6 6 6 6 6 6 6 6 6 6 6 1 1 1 1 1 1 1 1 1 1 1 1 1 1 1 1 1 1 1 1 1 1 1 1 1 1 1 1 1 1 1 1
symmnumber: 1
zpe: 1145190.5 jmol-1
zpe.correction: 0.436180 hartree
zpe.thermalcorrener: 0.457234 hartree
zpe.thermalcorrenthalpy: 0.458178 hartree
zpe.thermalcorrgfe: 0.382469 hartree
zpe.sumelectzpe: -589.514660 hartree
zpe.sumelectthermal: -589.493606 hartree
zpe.sumelectthermalent: -589.492662 hartree
zpe.sumelectthermalfe: -589.568370 hartree
dipole: -0.0105 -0.0068 -0.1586
dipole: 0.1591
quadrupole: -102.9549 -99.3408 -100.0853
quadrupole: 0.0548 -0.4407 1.1094
quadrupole: -2.1612 1.4528 0.7084 0.0548 -0.4407 1.1094
hfenergy: -589.9508399 hartree
pointgroup: C01 [X(C15H32)]
dipole: 0.0041264 -0.0015814 0.0624428 debye
polarizability: 211.4088867|1.026891|144.5689293|-0.2309285|1.5193605|139.2558664 unknown
InChI: InChI=1S/C15H32/c1-4-6-7-8-9-10-11-12-13-14-15(3)5-2/h15H,4-14H2,1-3H3
charge 0 multiplicity 1
47 atoms
C  -4.241475 -0.7531 -0.242905
C  -5.589086 -0.386012 0.437168
C  -2.987005 -0.143809 0.423264
C  -1.667907 -0.626329 -0.222032
C  -0.404785 -0.028685 0.438049
C  0.909344 -0.472474 -0.243235
C  2.175816 0.107955 0.425646
C  3.485031 -0.296912 -0.288677
C  -5.858616 1.14735 0.49666
C  4.754285 0.272053 0.384915
C  -6.757302 -1.146988 -0.236714
C  6.059905 -0.105563 -0.350673
C  -5.89227 1.867811 -0.871062
C  7.330538 0.45749 0.326311
C  8.628372 0.088711 -0.424672
H  -4.272993 -0.453295 -1.311077
H  -4.142018 -1.859232 -0.241877
H  -5.528687 -0.735438 1.491782
H  -3.029027 0.96309 0.367758
H  -2.98352 -0.401511 1.503588
H  -1.618704 -1.73443 -0.171494
H  -1.674013 -0.366397 -1.30167
H  -0.379539 -0.317427 1.50981
H  -0.470259 1.079606 0.417279
H  0.887128 -0.167043 -1.310546
H  0.968676 -1.581179 -0.239878
H  2.10139 1.21555 0.451254
H  2.216932 -0.224362 1.484223
H  3.5555 -1.404348 -0.326318
H  3.445739 0.046764 -1.343789
H  -6.827839 1.307347 1.012083
H  -5.090551 1.626903 1.135288
H  4.673908 1.378094 0.441998
H  4.806493 -0.089298 1.433518
H  -6.601523 -2.24073 -0.178622
H  -7.722864 -0.914909 0.25114
H  -6.846842 -0.88227 -1.307134
H  6.139721 -1.211223 -0.414716
H  6.010505 0.262446 -1.397148
H  -6.670359 1.448893 -1.534825
H  -6.11158 2.94356 -0.73949
H  -4.922496 1.788094 -1.395744
H  7.244844 1.561124 0.399121
H  7.384734 0.081332 1.368472
H  8.611942 0.481622 -1.458973
H  9.521457 0.501672 0.079756
H  8.752098 -1.009204 -0.486213
