program: Gaussian 09
title: 000086701
version: EM64L-G09RevD.01
frameworkgroup: C1[X(C8H14Cl2Si)]
method: RPBEPBE
basis: SDD
operation: Freq
keyword: #p
keyword: freq=noraman
keyword: PBEPBE/SDD
title: #p freq=noraman PBEPBE/SDD
converged: YES YES NO NO
title: Mulliken charges:
elementType: Cl Cl Si C C C C C C C C H H H H H H H H H H H H H H
charge: -0.290049 -0.291067 0.900983 -0.140890 -0.128409 -0.570350 -0.490183 -0.474559 -0.490221 -0.451712 -0.987121 0.259786 0.238918 0.294497 0.231336 0.229617 0.240966 0.228701 0.218254 0.233663 0.230645 0.208635 0.255540 0.283693 0.259325
chargesum: 0.00000
title: Mulliken charges with hydrogens summed into heavy atoms:
elementType: Cl Cl Si C C C C C C C C
charge: -0.290049 -0.291067 0.900983 0.118896 0.110509 -0.275853 -0.029230 -0.004892 -0.038304 -0.012431 -0.188562
polarizability: 1.34435560e+02 -8.47908328e-01 1.20826413e+02 -8.48431962e-01 2.67894496e-01 1.05370868e+02
1716.lowfreq: -31.7641 -14.6801 0.0013 0.0029 0.0032 4.5927 17.3425 66.5311 77.1315
frequency: -12.4139 66.3755 77.1098 119.9524 151.9211 162.1810 174.2546 184.4511 237.2758 248.0935 316.2182 380.7688 430.3404 452.4974 480.3394 568.3436 633.3316 732.6857 755.7113 780.8886 802.9410 835.5870 857.7436 867.4018 881.7385 910.2446 920.2438 925.4451 945.4732 960.9513 972.9208 1007.8462 1040.4953 1046.2550 1109.6990 1126.5876 1141.8355 1149.9466 1199.0058 1203.5031 1240.8744 1255.0842 1263.9933 1270.8784 1285.2971 1295.0424 1311.1523 1317.1895 1320.4565 1430.4555 1441.1523 1464.7792 1466.9990 1476.6453 1493.0355 2987.0073 2997.4024 2998.0120 3007.5382 3011.8833 3019.3742 3052.0812 3057.4446 3065.3609 3070.0140 3075.4489 3080.6693 3106.2508 3111.6656
redmass: 3.7648 7.9031 3.2542 6.4753 3.3880 3.0586 3.4238 1.1911 3.1692 4.7213 3.3347 2.0459 3.1656 2.7249 9.7403 3.5115 3.9813 4.7905 4.1121 2.9621 1.5444 2.3923 1.5963 1.3818 2.0510 2.7957 1.7359 2.6503 2.1566 1.7232 1.9371 2.2021 1.4515 1.5979 1.1417 1.2022 1.2697 1.5434 1.2834 1.4873 1.3254 1.3256 1.3547 1.5321 1.6697 1.4142 1.4606 1.2359 1.3948 1.0479 1.0506 1.0878 1.0878 1.0849 1.0957 1.0655 1.0591 1.0341 1.0594 1.0625 1.0843 1.1015 1.0903 1.0994 1.0928 1.1042 1.1050 1.0993 1.0986
irintensity: 0.2768 0.4308 1.8648 3.6756 1.2713 0.3438 7.5476 1.0846 0.3724 1.0549 5.7163 1.4210 35.7513 31.5548 95.5590 4.3003 10.7917 27.6197 1.2331 12.4584 6.1434 5.6665 33.2632 50.6771 36.7191 52.3133 1.4263 3.3845 0.7375 1.3224 5.6735 3.8503 6.0255 0.6476 1.7727 4.6179 1.7624 9.1801 5.0385 7.6321 1.9501 3.3278 0.0329 2.3011 3.1105 5.0660 0.1907 39.1617 2.1072 8.2024 9.4792 9.2002 9.7909 14.8756 2.1493 29.9822 26.1110 1.6774 53.1353 47.6825 3.1194 13.3955 44.6925 7.4732 17.0255 36.8409 85.6136 5.3912 3.2208
temp: 298.150 k
press: 1.00000 atm
elementType: 17 17 14 6 6 6 6 6 6 6 6 1 1 1 1 1 1 1 1 1 1 1 1 1 1
symmnumber: 1
zpe: 537313.4 jmol-1
zpe.correction: 0.204652 hartree
zpe.thermalcorrener: 0.216284 hartree
zpe.thermalcorrenthalpy: 0.217228 hartree
zpe.thermalcorrgfe: 0.166293 hartree
zpe.sumelectzpe: -1521.977524 hartree
zpe.sumelectthermal: -1521.965891 hartree
zpe.sumelectthermalent: -1521.964947 hartree
zpe.sumelectthermalfe: -1522.015882 hartree
dipole: -4.0320 -0.4202 2.2005
dipole: 4.6125
quadrupole: -94.6178 -94.2124 -86.3039
quadrupole: -0.5934 5.0726 -0.5256
quadrupole: -2.9064 -2.5010 5.4074 -0.5934 5.0726 -0.5256
hfenergy: -1522.1821754 hartree
pointgroup: C01 [X(C8H14Cl2Si1)]
dipole: -1.5466486 0.3441311 -0.8846608 debye
dipolederiv: -0.5977109 -0.1578477 -0.1241628 -0.220644 -0.5499797 -0.1847247 -0.1494893 -0.1743581 -0.5177515 -0.543556 0.1761261 -0.0088086 0.2462049 -0.7538704 0.0557487 0.0078399 0.0427866 -0.3638334 1.7048181 -0.0323336 0.1522042 -0.0380575 1.6589826 0.1230983 0.1034276 0.1210563 1.2844559 0.0376769 -0.0162252 -0.03079 0.1238679 0.1029828 0.0279962 0.219277 0.0632931 0.0869661 0.1153332 -0.0178242 0.0195807 0.0298633 0.0906709 -0.0398551 0.0594916 -0.0443093 0.0660209 -0.2378766 -0.0296781 -0.0635293 0.0155055 -0.3592184 -0.0230878 -0.1500916 -0.0245696 -0.2575582 0.0632561 0.0545499 0.0150475 0.0514655 -0.0155666 0.0055076 -0.0171716 0.0092954 -0.0170631 -0.0430637 0.0806008 -0.0347076 -0.1161197 0.0994123 -0.0095514 -0.0341161 -0.0392708 0.1048791 -0.0106584 0.0383602 0.0444413 -0.0209293 0.0579859 0.0172447 -0.0255817 -0.0040513 0.0890987 0.0836288 -0.0240848 0.0402241 -0.0078267 -0.0179049 0.0418162 0.039822 0.0510318 0.08621 -0.4582747 -0.0106818 0.044552 -0.0085651 -0.313251 0.0303287 0.0677488 0.0320283 -0.4338413 0.0177368 0.0927463 0.0386554 0.0811094 -0.0768664 -0.0500115 0.027371 -0.0501799 0.0420902 -0.0412464 0.0921628 -0.0350705 0.0927708 -0.108932 0.0728087 -0.057484 0.0814619 0.0394177 0.0200796 -0.0089647 0.0533032 0.0202419 0.0419689 0.0426979 -0.0361205 0.0518807 -0.0795504 -0.0841498 -0.0706134 -0.1312638 -0.077319 0.0270594 -0.0774519 -0.0942333 -0.0483135 -0.0034888 -0.0375281 -0.0548344 0.1473805 -0.0685565 0.0188441 0.0710479 0.1211811 0.0479553 -0.0448523 -0.0156221 -0.1049949 0.0501887 -0.0909928 -0.034388 0.0528859 0.0727989 0.0937616 0.010301 0.018926 0.0424618 0.0191864 0.0346097 0.0167917 -0.0570082 0.0205851 -0.1108835 -0.1037604 0.0633187 0.0465714 -0.0625846 0.0244445 0.0260255 0.0481889 -0.0303535 0.1012656 -0.128683 -0.0802876 -0.1170029 -0.0367212 -0.0976441 -0.0825144 -0.0407293 -0.0502787 -0.0881699 0.0453403 -0.1895218 -0.0001295 -0.0447447 -0.0309288 0.0513859 -0.0097303 -0.1051094 -0.0008009 0.0499231 0.0684354 0.0043781 -0.0000669 0.0399248 0.0129682 -0.0808428 0.072184 -0.0867643 -0.1390778 0.1067879 0.0700568 -0.0294113 0.0851523 -0.0480034 0.0270186 -0.0567652 0.0650575 0.0791308 -0.0616508 -0.0082565 0.04164 -0.0229864 0.1186593 0.0032273 0.0919646 0.0010656 0.1028868 0.1011494 -0.0445424 -0.0645425 -0.0445907 0.0367576 -0.0466226 -0.0968968 -0.0902685 0.0027397 unknown
polarizability: 134.3108375|0.3837911|120.1546068|2.2245008|3.1420298|106.1673979 unknown
InChI: InChI=1S/C8H14Cl2Si/c1-11(9,10)8-5-6-2-3-7(8)4-6/h6-8H,2-5H2,1H3
charge 0 multiplicity 1
25 atoms
Cl 2.977777 1.401089 1.223192
Cl 2.750232 -2.000927 0.203355
Si 1.861431 0.002561 -0.071912
C  -0.881953 -1.001233 -0.254886
C  -1.982624 1.001749 -0.283978
C  0.068478 -0.050933 0.560445
C  -1.47525 -0.0379 -1.324852
C  -0.667382 1.348572 0.473597
C  -2.133963 -1.272285 0.634411
C  -2.874353 0.117985 0.64138
C  2.211477 0.515167 -1.855595
H  -0.399987 -1.920417 -0.627461
H  -2.498811 1.886192 -0.691914
H  0.131433 -0.394319 1.6102
H  -2.289291 -0.502103 -1.909245
H  -0.725554 0.376381 -2.022999
H  -0.086577 2.102407 -0.092643
H  -0.852327 1.771181 1.475964
H  -1.855692 -1.615283 1.646484
H  -2.764243 -2.058046 0.179029
H  -3.897433 0.028417 0.233858
H  -2.957174 0.546996 1.656034
H  1.812075 1.523795 -2.061509
H  3.300608 0.534079 -2.030357
H  1.759403 -0.202823 -2.5622
